{"text_format":"1","workbook":"xlsx","n_sheets":4,"sheets":["Instructions","Marks Entry","Report Card","Abstract"],"not_rendered":{"charts":1,"images":2,"macros":1,"external_links":1,"defined_names":3,"comments":0,"pivot_tables":0},"unopened":[],"bounds":{"document_bytes":16777216,"sheet_cells":100000,"rows_first":2000,"rows_last":500,"rows_between":2000,"halvings":0,"cell_chars":16384,"cell_head_chars":4096},"cells_cut":0,"cells_raw":0,"read":"whole","date_system":"1900"}

{"sheet":"Instructions","index":0,"n_rows":36,"n_cols":12,"rows_kept":36,"cut":false,"hidden":false,"merged":[[0,0,0,5],[16,1,16,2],[21,1,21,2],[8,1,8,4],[3,1,3,2],[4,1,4,5],[9,1,9,4],[6,1,6,6],[7,1,7,6]]}
["Instructions",null,null,null,null,null,null,null,null,null,"Year","Month"]
["Kindly read All Instructions before Use Report Card Utitly",null,null,null,null,null,null,null,null,null,2022,"Sept"]
[null,null,null,null,null,null,null,null,null,null,2023,"March"]
[1,"First Fill  Necessary Data for report card by click on ",null,"Fill Data",null,null,null,null,null,null,2024]
[2,"In All Sheet Use only or Click on  Yellow coloured Filled  Cell to Enter or Select Data. Rest Cells Are Locked",null,null,null,null,null,null,null,null,2025]
[3,"Now Goto Marks Entry Sheet 6-8 . Then Enter Data ( Marks) in Yellow cell thier",null,null,null,null,null,null,null,null,2026]
[4,"Enter Subjects Total Marks for Each Subject in this sheet at Row no . 20 onwards",null,null,null,null,null,null,null,null,2027]
[5,"You can find Grade Wise , Class Wise , Subject Wise Students count and Topper List",null,null,null,null,null,null,null,null,2028]
[6,"you can copy Paste Students Data Like Name ,Father Name, Class Etc.  From Epunjab Student Report Excel File",null,null,null,null,null,null,null,null,2029]
[7,"After Entered All data in yellow cell of Marks Entry 6-8 Sheet . Goto Report Card to View/Print report card of each Students",null,null,null,null,null,null,null,null,2030]
[]
[]
[]
[]
[]
[]
[null,"Select to  Fill Data"]
[null,"Select Year Below","Select Month"]
[null,2026,"March"]
[null,"Enter Date of Report Card Preparation","2026-03-31"]
[]
[null,"Enter Maximum Subject Marks"]
[null,"Punjabi",150]
[null,"English",100]
[null,"Hindi",100]
[null,"Maths",100]
[null,"Science",100]
[null,"social Sci.",100]
[null,"Computer Sci",100]
[null,"HEALTH & PHY. EDU.",100,13]
[null,"MECH. DRAWING & PAINTING",100,23]
[null,"NSQF",100,10]
[null,"Grand Total (Except Grading Subject)",{"$f":"SUM(C23:C28)","v":650}]
[]
[]
[null,"Write Optional Subject name in blue cell carefully "]

{"sheet":"Marks Entry","index":1,"n_rows":503,"n_cols":77,"rows_kept":503,"cut":false,"hidden":false,"merged":[[0,40,0,43],[0,36,0,39],[0,32,0,35],[0,10,0,12],[0,13,0,15],[0,28,0,31],[0,16,0,18],[0,19,0,21],[0,22,0,24],[0,25,0,27]]}
[null,null,null,null,null,null,null,null,null,null,"Punjabi",null,null,"English",null,null,"Hindi",null,null,"Maths",null,null,"Science",null,null,"social Sci.",null,null,"Computer Sci",null,null,null,{"$f":"Instructions!B32","v":"NSQF"},null,null,null,{"$f":"Instructions!B31","v":"MECH. DRAWING & PAINTING"},null,null,null,{"$f":"Instructions!B30","v":"HEALTH & PHY. EDU."}]
["Sno",null,"Class","Sec","Student ID","Name","FatherName","MotherName","DOB","Gender","Th. (130)","INA (20)","Total","Th. (80)","INA (20)","Total","Th. (80)","INA (20)","Total","Th. (80)","INA (20)","Total","Th. (80)","INA (20)","Total","Th. (80)","INA (20)","Total","Th.","INA (20)","Pract","Total","Th.","INA ","Pract","Total","Th.","INA ","Pract",{"$f":"IF(AK2<Instructions!H31,\"\",SUM(AK2:AM2))","v":0},"Th.","INA ","Pract","Total","Total Marks ","Total w/o F","Elective Subh","Sub Name","Pbi%","Eng","Hindi","Maths.","Science","social Sci.","Com Sci","NSQF","Drawing","Elec Sub %","Total %","Pass/Fail","Pbi Grade. ","Eng","Hindi","Maths.","Science","SS","Com Sci","NSQF","Drg","Phy","Grade total","Elec Sub Grade",null,null,null,null,{"$f":"Table_2[[#This Row],[Column51]]&Table_2[[#This Row],[Column52]]&BU4","v":""}]
[1,null,10,"A",12122,"Ram","Sham","rita","25-2-25","Male",50,20,{"$f":"IF(K3<33,K3,SUM(K3:L3))","v":70},20,20,{"$f":"IF(N3<20,N3,SUM(N3:O3))","v":40},80,20,{"$f":"IF(Q3<20,Q3,SUM(Q3:R3))","v":100},null,20,{"$f":"IF(T3<20,T3,SUM(T3:U3))","v":0},60,10,{"$f":"IF(W3<20,W3,SUM(W3:X3))","v":70},40,20,{"$f":"IF(Z3<20,Z3,SUM(Z3:AA3))","v":60},null,20,30,{"$f":"IF(AC3<10,AC3,SUM(AC3:AE3))","v":0},null,null,null,{"$f":"IF(AG3<Instructions!D32,AG3,SUM(AG3:AI3))","v":0},40,20,null,{"$f":"IF(AK3<Instructions!D31,AK3,SUM(AK3:AM3))","v":60},null,null,null,{"$f":"IF(AO3<Instructions!D30,AO3,SUM(AO3:AQ3))","v":0},{"$f":"IF(MIN(M3,P3,S3,V3,Y3,AB3)>=33,SUM(M3,P3,S3,V3,Y3,AB3),\"--\")","v":"--"},{"$f":"IF(AS3=\"--\",0,AS3)","v":0},{"$f":"SUM(Table_2[[#This Row],[Column20]],Table_2[[#This Row],[Column19]],Table_2[[#This Row],[Column18]])","v":60},{"$f":"IF(N(AJ3)>0,$AG$1,IF(N(AN3)>0,$AK$1,$AO$1))","v":"MECH. DRAWING & PAINTING"},{"$f":"(M3/Instructions!$C$23)*100","v":46.666666666666664},{"$f":"(P3/Instructions!$C$24)*100","v":40},{"$f":"(S3/Instructions!$C$25)*100","v":100},{"$f":"(V3/Instructions!$C$26)*100","v":0},{"$f":"(Y3/Instructions!$C$27)*100","v":70},{"$f":"(AB3/Instructions!$C$28)*100","v":60},{"$f":"(AF3/Instructions!$C$29)*100","v":0},{"$f":"(AJ3/Instructions!$C$30)*100","v":0},{"$f":"(AN3/Instructions!$C$31)*100","v":60},{"$f":"(AU3/100)*100","v":60},{"$f":"(AS3/Instructions!$C$33)*100","v":{"$error":"#VALUE!"}},{"$f":"IF(AND(AW3>=33,AX3>=33,AY3>=33,AZ3>=33,BA3>=33,BB3>=33),\"PASS\",\"----\")","v":"----"},{"$f":"IFERROR(IF(AW3>90,\"A+\",IF(AW3>80,\"A\",IF(AW3>70,\"B+\",IF(AW3>60,\"B\",IF(AW3>50,\"C+\",IF(AW3>40,\"C\",IF(AW3>=33,\"D\",\"E\"))))))),\"Abs\")","v":"C"},"D","A+","E","B","C+","E","E","C+","C+",{"$f":"IFERROR(IF(BG3>90,\"A+\",IF(BG3>80,\"A\",IF(BG3>70,\"B+\",IF(BG3>60,\"B\",IF(BG3>50,\"C+\",IF(BG3>40,\"C\",IF(BG3>=33,\"D\",\"E\"))))))),\"--\")","v":"--"},{"$f":"IFERROR(IF(BF3>90,\"A+\",IF(BF3>80,\"A\",IF(BF3>70,\"B+\",IF(BF3>60,\"B\",IF(BF3>50,\"C+\",IF(BF3>40,\"C\",IF(BF3>=33,\"D\",\"E\"))))))),\"Abs\")","v":"C+"},null,null,null,null,{"$f":"Table_2[[#This Row],[Column51]]&Table_2[[#This Row],[Column52]]&BU5","v":""}]
[2,null,null,null,null,null,null,null,null,null,null,null,{"$f":"IF(K4<33,K4,SUM(K4:L4))","v":0},null,null,{"$f":"IF(N4<20,N4,SUM(N4:O4))","v":0},null,null,{"$f":"IF(Q4<20,Q4,SUM(Q4:R4))","v":0},null,null,{"$f":"IF(T4<20,T4,SUM(T4:U4))","v":0},null,null,{"$f":"IF(W4<20,W4,SUM(W4:X4))","v":0},null,null,{"$f":"IF(Z4<20,Z4,SUM(Z4:AA4))","v":0},null,null,null,{"$f":"IF(AC4<10,AC4,SUM(AC4:AE4))","v":0},null,null,null,{"$f":"IF(AG4<Instructions!D33,AG4,SUM(AG4:AI4))","v":0},null,null,null,{"$f":"IF(AK4<Instructions!D32,AK4,SUM(AK4:AM4))","v":0},null,null,null,{"$f":"IF(AO4<Instructions!D31,AO4,SUM(AO4:AQ4))","v":0},{"$f":"IF(MIN(M4,P4,S4,V4,Y4,AB4)>=33,SUM(M4,P4,S4,V4,Y4,AB4),\"--\")","v":"--"},{"$f":"IF(AS4=\"--\",0,AS4)","v":0},{"$f":"SUM(Table_2[[#This Row],[Column20]],Table_2[[#This Row],[Column19]],Table_2[[#This Row],[Column18]])","v":0},{"$f":"IF(N(AJ4)>0,$AG$1,IF(N(AN4)>0,$AK$1,$AO$1))","v":"HEALTH & PHY. EDU."},{"$f":"(M4/Instructions!$C$23)*100","v":0},{"$f":"(P4/Instructions!$C$24)*100","v":0},{"$f":"(S4/Instructions!$C$25)*100","v":0},{"$f":"(V4/Instructions!$C$26)*100","v":0},{"$f":"(Y4/Instructions!$C$27)*100","v":0},{"$f":"(AB4/Instructions!$C$28)*100","v":0},{"$f":"(AF4/Instructions!$C$29)*100","v":0},{"$f":"(AJ4/Instructions!$C$30)*100","v":0},{"$f":"(AN4/Instructions!$C$31)*100","v":0},{"$f":"(AR4/100)*100","v":0},{"$f":"(AS4/Instructions!$C$33)*100","v":{"$error":"#VALUE!"}},{"$f":"IF(AND(AW4>=33,AX4>=33,AY4>=33,AZ4>=33,BA4>=33,BB4>=33),\"PASS\",\"----\")","v":"----"},"E","E","E","E","E","E","E","E","E","E",{"$f":"IFERROR(IF(BG4>90,\"A+\",IF(BG4>80,\"A\",IF(BG4>70,\"B+\",IF(BG4>60,\"B\",IF(BG4>50,\"C+\",IF(BG4>40,\"C\",IF(BG4>=33,\"D\",\"E\"))))))),\"--\")","v":"--"},{"$f":"IFERROR(IF(BF4>90,\"A+\",IF(BF4>80,\"A\",IF(BF4>70,\"B+\",IF(BF4>60,\"B\",IF(BF4>50,\"C+\",IF(BF4>40,\"C\",IF(BF4>=33,\"D\",\"E\"))))))),\"Abs\")","v":"E"},null,null,null,null,{"$f":"Table_2[[#This Row],[Column51]]&Table_2[[#This Row],[Column52]]&BU6","v":""}]
[3,null,null,null,null,null,null,null,null,null,null,null,0,null,null,0,null,null,0,null,null,0,null,null,0,null,null,0,null,null,null,0,null,null,null,{"$f":"IF(AG5<Instructions!D34,AG5,SUM(AG5:AI5))","v":0},null,null,null,{"$f":"IF(AK5<Instructions!D33,AK5,SUM(AK5:AM5))","v":0},null,null,null,{"$f":"IF(AO5<Instructions!D32,AO5,SUM(AO5:AQ5))","v":0},"--",0,{"$f":"SUM(Table_2[[#This Row],[Column20]],Table_2[[#This Row],[Column19]],Table_2[[#This Row],[Column18]])","v":0},"HEALTH & PHY. EDU.",{"$f":"(M5/Instructions!$C$23)*100","v":0},{"$f":"(P5/Instructions!$C$24)*100","v":0},{"$f":"(S5/Instructions!$C$25)*100","v":0},{"$f":"(V5/Instructions!$C$26)*100","v":0},{"$f":"(Y5/Instructions!$C$27)*100","v":0},{"$f":"(AB5/Instructions!$C$28)*100","v":0},{"$f":"(AF5/Instructions!$C$29)*100","v":0},{"$f":"(AJ5/Instructions!$C$30)*100","v":0},{"$f":"(AN5/Instructions!$C$31)*100","v":0},0,{"$f":"(AS5/Instructions!$C$33)*100","v":{"$error":"#VALUE!"}},"----","E","E","E","E","E","E","E","E","E","E","--","E"]
[4,null,null,null,null,null,null,null,null,null,null,null,0,null,null,0,null,null,0,null,null,0,null,null,0,null,null,0,null,null,null,0,null,null,null,{"$f":"IF(AG6<Instructions!D35,AG6,SUM(AG6:AI6))","v":0},null,null,null,{"$f":"IF(AK6<Instructions!D34,AK6,SUM(AK6:AM6))","v":0},null,null,null,{"$f":"IF(AO6<Instructions!D33,AO6,SUM(AO6:AQ6))","v":0},"--",0,{"$f":"SUM(Table_2[[#This Row],[Column20]],Table_2[[#This Row],[Column19]],Table_2[[#This Row],[Column18]])","v":0},"HEALTH & PHY. EDU.",{"$f":"(M6/Instructions!$C$23)*100","v":0},{"$f":"(P6/Instructions!$C$24)*100","v":0},{"$f":"(S6/Instructions!$C$25)*100","v":0},{"$f":"(V6/Instructions!$C$26)*100","v":0},{"$f":"(Y6/Instructions!$C$27)*100","v":0},{"$f":"(AB6/Instructions!$C$28)*100","v":0},{"$f":"(AF6/Instructions!$C$29)*100","v":0},{"$f":"(AJ6/Instructions!$C$30)*100","v":0},{"$f":"(AN6/Instructions!$C$31)*100","v":0},0,{"$f":"(AS6/Instructions!$C$33)*100","v":{"$error":"#VALUE!"}},"----","E","E","E","E","E","E","E","E","E","E","--","E"]
[5,null,null,null,null,null,null,null,null,null,null,null,0,null,null,0,null,null,0,null,null,0,null,null,0,null,null,0,null,null,null,0,null,null,null,{"$f":"IF(AG7<Instructions!D36,AG7,SUM(AG7:AI7))","v":0},null,null,null,{"$f":"IF(AK7<Instructions!D35,AK7,SUM(AK7:AM7))","v":0},null,null,null,{"$f":"IF(AO7<Instructions!D34,AO7,SUM(AO7:AQ7))","v":0},"--",0,{"$f":"SUM(Table_2[[#This Row],[Column20]],Table_2[[#This Row],[Column19]],Table_2[[#This Row],[Column18]])","v":0},"HEALTH & PHY. EDU.",{"$f":"(M7/Instructions!$C$23)*100","v":0},{"$f":"(P7/Instructions!$C$24)*100","v":0},{"$f":"(S7/Instructions!$C$25)*100","v":0},{"$f":"(V7/Instructions!$C$26)*100","v":0},{"$f":"(Y7/Instructions!$C$27)*100","v":0},{"$f":"(AB7/Instructions!$C$28)*100","v":0},{"$f":"(AF7/Instructions!$C$29)*100","v":0},{"$f":"(AJ7/Instructions!$C$30)*100","v":0},{"$f":"(AN7/Instructions!$C$31)*100","v":0},0,{"$f":"(AS7/Instructions!$C$33)*100","v":{"$error":"#VALUE!"}},"----","E","E","E","E","E","E","E","E","E","E","--","E"]
[6,null,null,null,null,null,null,null,null,null,null,null,0,null,null,0,null,null,0,null,null,0,null,null,0,null,null,0,null,null,null,0,null,null,null,{"$f":"IF(AG8<Instructions!D37,AG8,SUM(AG8:AI8))","v":0},null,null,null,{"$f":"IF(AK8<Instructions!D36,AK8,SUM(AK8:AM8))","v":0},null,null,null,{"$f":"IF(AO8<Instructions!D35,AO8,SUM(AO8:AQ8))","v":0},"--",0,{"$f":"SUM(Table_2[[#This Row],[Column20]],Table_2[[#This Row],[Column19]],Table_2[[#This Row],[Column18]])","v":0},"HEALTH & PHY. EDU.",{"$f":"(M8/Instructions!$C$23)*100","v":0},{"$f":"(P8/Instructions!$C$24)*100","v":0},{"$f":"(S8/Instructions!$C$25)*100","v":0},{"$f":"(V8/Instructions!$C$26)*100","v":0},{"$f":"(Y8/Instructions!$C$27)*100","v":0},{"$f":"(AB8/Instructions!$C$28)*100","v":0},{"$f":"(AF8/Instructions!$C$29)*100","v":0},{"$f":"(AJ8/Instructions!$C$30)*100","v":0},{"$f":"(AN8/Instructions!$C$31)*100","v":0},0,{"$f":"(AS8/Instructions!$C$33)*100","v":{"$error":"#VALUE!"}},"----","E","E","E","E","E","E","E","E","E","E","--","E"]
[7,null,null,null,null,null,null,null,null,null,null,null,0,null,null,0,null,null,0,null,null,0,null,null,0,null,null,0,null,null,null,0,null,null,null,{"$f":"IF(AG9<Instructions!D38,AG9,SUM(AG9:AI9))","v":0},null,null,null,{"$f":"IF(AK9<Instructions!D37,AK9,SUM(AK9:AM9))","v":0},null,null,null,{"$f":"IF(AO9<Instructions!D36,AO9,SUM(AO9:AQ9))","v":0},"--",0,{"$f":"SUM(Table_2[[#This Row],[Column20]],Table_2[[#This Row],[Column19]],Table_2[[#This Row],[Column18]])","v":0},"HEALTH & PHY. EDU.",{"$f":"(M9/Instructions!$C$23)*100","v":0},{"$f":"(P9/Instructions!$C$24)*100","v":0},{"$f":"(S9/Instructions!$C$25)*100","v":0},{"$f":"(V9/Instructions!$C$26)*100","v":0},{"$f":"(Y9/Instructions!$C$27)*100","v":0},{"$f":"(AB9/Instructions!$C$28)*100","v":0},{"$f":"(AF9/Instructions!$C$29)*100","v":0},{"$f":"(AJ9/Instructions!$C$30)*100","v":0},{"$f":"(AN9/Instructions!$C$31)*100","v":0},0,{"$f":"(AS9/Instructions!$C$33)*100","v":{"$error":"#VALUE!"}},"----","E","E","E","E","E","E","E","E","E","E","--","E"]
[8,null,null,null,null,null,null,null,null,null,null,null,0,null,null,0,null,null,0,null,null,0,null,null,0,null,null,0,null,null,null,0,null,null,null,{"$f":"IF(AG10<Instructions!D39,AG10,SUM(AG10:AI10))","v":0},null,null,null,{"$f":"IF(AK10<Instructions!D38,AK10,SUM(AK10:AM10))","v":0},null,null,null,{"$f":"IF(AO10<Instructions!D37,AO10,SUM(AO10:AQ10))","v":0},"--",0,{"$f":"SUM(Table_2[[#This Row],[Column20]],Table_2[[#This Row],[Column19]],Table_2[[#This Row],[Column18]])","v":0},"HEALTH & PHY. EDU.",{"$f":"(M10/Instructions!$C$23)*100","v":0},{"$f":"(P10/Instructions!$C$24)*100","v":0},{"$f":"(S10/Instructions!$C$25)*100","v":0},{"$f":"(V10/Instructions!$C$26)*100","v":0},{"$f":"(Y10/Instructions!$C$27)*100","v":0},{"$f":"(AB10/Instructions!$C$28)*100","v":0},{"$f":"(AF10/Instructions!$C$29)*100","v":0},{"$f":"(AJ10/Instructions!$C$30)*100","v":0},{"$f":"(AN10/Instructions!$C$31)*100","v":0},0,{"$f":"(AS10/Instructions!$C$33)*100","v":{"$error":"#VALUE!"}},"----","E","E","E","E","E","E","E","E","E","E","--","E"]
[9,null,null,null,null,null,null,null,null,null,null,null,0,null,null,0,null,null,0,null,null,0,null,null,0,null,null,0,null,null,null,0,null,null,null,{"$f":"IF(AG11<Instructions!D40,AG11,SUM(AG11:AI11))","v":0},null,null,null,{"$f":"IF(AK11<Instructions!D39,AK11,SUM(AK11:AM11))","v":0},null,null,null,{"$f":"IF(AO11<Instructions!D38,AO11,SUM(AO11:AQ11))","v":0},"--",0,{"$f":"SUM(Table_2[[#This Row],[Column20]],Table_2[[#This Row],[Column19]],Table_2[[#This Row],[Column18]])","v":0},"HEALTH & PHY. EDU.",{"$f":"(M11/Instructions!$C$23)*100","v":0},{"$f":"(P11/Instructions!$C$24)*100","v":0},{"$f":"(S11/Instructions!$C$25)*100","v":0},{"$f":"(V11/Instructions!$C$26)*100","v":0},{"$f":"(Y11/Instructions!$C$27)*100","v":0},{"$f":"(AB11/Instructions!$C$28)*100","v":0},{"$f":"(AF11/Instructions!$C$29)*100","v":0},{"$f":"(AJ11/Instructions!$C$30)*100","v":0},{"$f":"(AN11/Instructions!$C$31)*100","v":0},0,{"$f":"(AS11/Instructions!$C$33)*100","v":{"$error":"#VALUE!"}},"----","E","E","E","E","E","E","E","E","E","E","--","E"]
[10,null,null,null,null,null,null,null,null,null,null,null,0,null,null,0,null,null,0,null,null,0,null,null,0,null,null,0,null,null,null,0,null,null,null,{"$f":"IF(AG12<Instructions!D41,AG12,SUM(AG12:AI12))","v":0},null,null,null,{"$f":"IF(AK12<Instructions!D40,AK12,SUM(AK12:AM12))","v":0},null,null,null,{"$f":"IF(AO12<Instructions!D39,AO12,SUM(AO12:AQ12))","v":0},"--",0,{"$f":"SUM(Table_2[[#This Row],[Column20]],Table_2[[#This Row],[Column19]],Table_2[[#This Row],[Column18]])","v":0},"HEALTH & PHY. EDU.",{"$f":"(M12/Instructions!$C$23)*100","v":0},{"$f":"(P12/Instructions!$C$24)*100","v":0},{"$f":"(S12/Instructions!$C$25)*100","v":0},{"$f":"(V12/Instructions!$C$26)*100","v":0},{"$f":"(Y12/Instructions!$C$27)*100","v":0},{"$f":"(AB12/Instructions!$C$28)*100","v":0},{"$f":"(AF12/Instructions!$C$29)*100","v":0},{"$f":"(AJ12/Instructions!$C$30)*100","v":0},{"$f":"(AN12/Instructions!$C$31)*100","v":0},0,{"$f":"(AS12/Instructions!$C$33)*100","v":{"$error":"#VALUE!"}},"----","E","E","E","E","E","E","E","E","E","E","--","E"]
[11,null,null,null,null,null,null,null,null,null,null,null,0,null,null,0,null,null,0,null,null,0,null,null,0,null,null,0,null,null,null,0,null,null,null,{"$f":"IF(AG13<Instructions!D42,AG13,SUM(AG13:AI13))","v":0},null,null,null,{"$f":"IF(AK13<Instructions!D41,AK13,SUM(AK13:AM13))","v":0},null,null,null,{"$f":"IF(AO13<Instructions!D40,AO13,SUM(AO13:AQ13))","v":0},"--",0,{"$f":"SUM(Table_2[[#This Row],[Column20]],Table_2[[#This Row],[Column19]],Table_2[[#This Row],[Column18]])","v":0},"HEALTH & PHY. EDU.",{"$f":"(M13/Instructions!$C$23)*100","v":0},{"$f":"(P13/Instructions!$C$24)*100","v":0},{"$f":"(S13/Instructions!$C$25)*100","v":0},{"$f":"(V13/Instructions!$C$26)*100","v":0},{"$f":"(Y13/Instructions!$C$27)*100","v":0},{"$f":"(AB13/Instructions!$C$28)*100","v":0},{"$f":"(AF13/Instructions!$C$29)*100","v":0},{"$f":"(AJ13/Instructions!$C$30)*100","v":0},{"$f":"(AN13/Instructions!$C$31)*100","v":0},0,{"$f":"(AS13/Instructions!$C$33)*100","v":{"$error":"#VALUE!"}},"----","E","E","E","E","E","E","E","E","E","E","--","E"]
[12,null,null,null,null,null,null,null,null,null,null,null,0,null,null,0,null,null,0,null,null,0,null,null,0,null,null,0,null,null,null,0,null,null,null,{"$f":"IF(AG14<Instructions!D43,AG14,SUM(AG14:AI14))","v":0},null,null,null,{"$f":"IF(AK14<Instructions!D42,AK14,SUM(AK14:AM14))","v":0},null,null,null,{"$f":"IF(AO14<Instructions!D41,AO14,SUM(AO14:AQ14))","v":0},"--",0,{"$f":"SUM(Table_2[[#This Row],[Column20]],Table_2[[#This Row],[Column19]],Table_2[[#This Row],[Column18]])","v":0},"HEALTH & PHY. EDU.",{"$f":"(M14/Instructions!$C$23)*100","v":0},{"$f":"(P14/Instructions!$C$24)*100","v":0},{"$f":"(S14/Instructions!$C$25)*100","v":0},{"$f":"(V14/Instructions!$C$26)*100","v":0},{"$f":"(Y14/Instructions!$C$27)*100","v":0},{"$f":"(AB14/Instructions!$C$28)*100","v":0},{"$f":"(AF14/Instructions!$C$29)*100","v":0},{"$f":"(AJ14/Instructions!$C$30)*100","v":0},{"$f":"(AN14/Instructions!$C$31)*100","v":0},0,{"$f":"(AS14/Instructions!$C$33)*100","v":{"$error":"#VALUE!"}},"----","E","E","E","E","E","E","E","E","E","E","--","E",null,null,null,null,{"$f":"Table_2[[#This Row],[Column51]]&Table_2[[#This Row],[Column52]]&BU16","v":""}]
[13,null,null,null,null,null,null,null,null,null,null,null,0,null,null,0,null,null,0,null,null,0,null,null,0,null,null,0,null,null,null,0,null,null,null,{"$f":"IF(AG15<Instructions!D44,AG15,SUM(AG15:AI15))","v":0},null,null,null,{"$f":"IF(AK15<Instructions!D43,AK15,SUM(AK15:AM15))","v":0},null,null,null,{"$f":"IF(AO15<Instructions!D42,AO15,SUM(AO15:AQ15))","v":0},"--",0,{"$f":"SUM(Table_2[[#This Row],[Column20]],Table_2[[#This Row],[Column19]],Table_2[[#This Row],[Column18]])","v":0},"HEALTH & PHY. EDU.",{"$f":"(M15/Instructions!$C$23)*100","v":0},{"$f":"(P15/Instructions!$C$24)*100","v":0},{"$f":"(S15/Instructions!$C$25)*100","v":0},{"$f":"(V15/Instructions!$C$26)*100","v":0},{"$f":"(Y15/Instructions!$C$27)*100","v":0},{"$f":"(AB15/Instructions!$C$28)*100","v":0},{"$f":"(AF15/Instructions!$C$29)*100","v":0},{"$f":"(AJ15/Instructions!$C$30)*100","v":0},{"$f":"(AN15/Instructions!$C$31)*100","v":0},0,{"$f":"(AS15/Instructions!$C$33)*100","v":{"$error":"#VALUE!"}},"----","E","E","E","E","E","E","E","E","E","E","--","E",null,null,null,null,{"$f":"Table_2[[#This Row],[Column51]]&Table_2[[#This Row],[Column52]]&BU17","v":""}]
[14,null,null,null,null,null,null,null,null,null,null,null,0,null,null,0,null,null,0,null,null,0,null,null,0,null,null,0,null,null,null,0,null,null,null,{"$f":"IF(AG16<Instructions!D45,AG16,SUM(AG16:AI16))","v":0},null,null,null,{"$f":"IF(AK16<Instructions!D44,AK16,SUM(AK16:AM16))","v":0},null,null,null,{"$f":"IF(AO16<Instructions!D43,AO16,SUM(AO16:AQ16))","v":0},"--",0,{"$f":"SUM(Table_2[[#This Row],[Column20]],Table_2[[#This Row],[Column19]],Table_2[[#This Row],[Column18]])","v":0},"HEALTH & PHY. EDU.",{"$f":"(M16/Instructions!$C$23)*100","v":0},{"$f":"(P16/Instructions!$C$24)*100","v":0},{"$f":"(S16/Instructions!$C$25)*100","v":0},{"$f":"(V16/Instructions!$C$26)*100","v":0},{"$f":"(Y16/Instructions!$C$27)*100","v":0},{"$f":"(AB16/Instructions!$C$28)*100","v":0},{"$f":"(AF16/Instructions!$C$29)*100","v":0},{"$f":"(AJ16/Instructions!$C$30)*100","v":0},{"$f":"(AN16/Instructions!$C$31)*100","v":0},0,{"$f":"(AS16/Instructions!$C$33)*100","v":{"$error":"#VALUE!"}},"----","E","E","E","E","E","E","E","E","E","E","--","E",null,null,null,null,{"$f":"Table_2[[#This Row],[Column51]]&Table_2[[#This Row],[Column52]]&BU18","v":""}]
[15,null,null,null,null,null,null,null,null,null,null,null,0,null,null,0,null,null,0,null,null,0,null,null,0,null,null,0,null,null,null,0,null,null,null,{"$f":"IF(AG17<Instructions!D46,AG17,SUM(AG17:AI17))","v":0},null,null,null,{"$f":"IF(AK17<Instructions!D45,AK17,SUM(AK17:AM17))","v":0},null,null,null,{"$f":"IF(AO17<Instructions!D44,AO17,SUM(AO17:AQ17))","v":0},"--",0,{"$f":"SUM(Table_2[[#This Row],[Column20]],Table_2[[#This Row],[Column19]],Table_2[[#This Row],[Column18]])","v":0},"HEALTH & PHY. EDU.",{"$f":"(M17/Instructions!$C$23)*100","v":0},{"$f":"(P17/Instructions!$C$24)*100","v":0},{"$f":"(S17/Instructions!$C$25)*100","v":0},{"$f":"(V17/Instructions!$C$26)*100","v":0},{"$f":"(Y17/Instructions!$C$27)*100","v":0},{"$f":"(AB17/Instructions!$C$28)*100","v":0},{"$f":"(AF17/Instructions!$C$29)*100","v":0},{"$f":"(AJ17/Instructions!$C$30)*100","v":0},{"$f":"(AN17/Instructions!$C$31)*100","v":0},0,{"$f":"(AS17/Instructions!$C$33)*100","v":{"$error":"#VALUE!"}},"----","E","E","E","E","E","E","E","E","E","E","--","E",null,null,null,null,{"$f":"Table_2[[#This Row],[Column51]]&Table_2[[#This Row],[Column52]]&BU19","v":""}]
[16,null,null,null,null,null,null,null,null,null,null,null,0,null,null,0,null,null,0,null,null,0,null,null,0,null,null,0,null,null,null,0,null,null,null,{"$f":"IF(AG18<Instructions!D47,AG18,SUM(AG18:AI18))","v":0},null,null,null,{"$f":"IF(AK18<Instructions!D46,AK18,SUM(AK18:AM18))","v":0},null,null,null,{"$f":"IF(AO18<Instructions!D45,AO18,SUM(AO18:AQ18))","v":0},"--",0,{"$f":"SUM(Table_2[[#This Row],[Column20]],Table_2[[#This Row],[Column19]],Table_2[[#This Row],[Column18]])","v":0},"HEALTH & PHY. EDU.",{"$f":"(M18/Instructions!$C$23)*100","v":0},{"$f":"(P18/Instructions!$C$24)*100","v":0},{"$f":"(S18/Instructions!$C$25)*100","v":0},{"$f":"(V18/Instructions!$C$26)*100","v":0},{"$f":"(Y18/Instructions!$C$27)*100","v":0},{"$f":"(AB18/Instructions!$C$28)*100","v":0},{"$f":"(AF18/Instructions!$C$29)*100","v":0},{"$f":"(AJ18/Instructions!$C$30)*100","v":0},{"$f":"(AN18/Instructions!$C$31)*100","v":0},0,{"$f":"(AS18/Instructions!$C$33)*100","v":{"$error":"#VALUE!"}},"----","E","E","E","E","E","E","E","E","E","E","--","E",null,null,null,null,{"$f":"Table_2[[#This Row],[Column51]]&Table_2[[#This Row],[Column52]]&BU20","v":""}]
[17,null,null,null,null,null,null,null,null,null,null,null,0,null,null,0,null,null,0,null,null,0,null,null,0,null,null,0,null,null,null,0,null,null,null,{"$f":"IF(AG19<Instructions!D48,AG19,SUM(AG19:AI19))","v":0},null,null,null,{"$f":"IF(AK19<Instructions!D47,AK19,SUM(AK19:AM19))","v":0},null,null,null,{"$f":"IF(AO19<Instructions!D46,AO19,SUM(AO19:AQ19))","v":0},"--",0,{"$f":"SUM(Table_2[[#This Row],[Column20]],Table_2[[#This Row],[Column19]],Table_2[[#This Row],[Column18]])","v":0},"HEALTH & PHY. EDU.",{"$f":"(M19/Instructions!$C$23)*100","v":0},{"$f":"(P19/Instructions!$C$24)*100","v":0},{"$f":"(S19/Instructions!$C$25)*100","v":0},{"$f":"(V19/Instructions!$C$26)*100","v":0},{"$f":"(Y19/Instructions!$C$27)*100","v":0},{"$f":"(AB19/Instructions!$C$28)*100","v":0},{"$f":"(AF19/Instructions!$C$29)*100","v":0},{"$f":"(AJ19/Instructions!$C$30)*100","v":0},{"$f":"(AN19/Instructions!$C$31)*100","v":0},0,{"$f":"(AS19/Instructions!$C$33)*100","v":{"$error":"#VALUE!"}},"----",{"$f":"IFERROR(IF(AW19>90,\"A+\",IF(AW19>80,\"A\",IF(AW19>70,\"B+\",IF(AW19>60,\"B\",IF(AW19>50,\"C+\",IF(AW19>40,\"C\",IF(AW19>=33,\"D\",\"E\"))))))),\"Abs\")","v":"E"},"E",{"$f":"IFERROR(IF(AY19>90,\"A+\",IF(AY19>80,\"A\",IF(AY19>70,\"B+\",IF(AY19>60,\"B\",IF(AY19>50,\"C+\",IF(AY19>40,\"C\",IF(AY19>=33,\"D\",\"E\"))))))),\"Abs\")","v":"E"},"E","E","E","E","E","E","E","--","E",null,null,null,null,{"$f":"Table_2[[#This Row],[Column51]]&Table_2[[#This Row],[Column52]]&BU21","v":""}]
[18,null,null,null,null,null,null,null,null,null,null,null,0,null,null,0,null,null,0,null,null,0,null,null,0,null,null,0,null,null,null,0,null,null,null,{"$f":"IF(AG20<Instructions!D49,AG20,SUM(AG20:AI20))","v":0},null,null,null,{"$f":"IF(AK20<Instructions!D48,AK20,SUM(AK20:AM20))","v":0},null,null,null,{"$f":"IF(AO20<Instructions!D47,AO20,SUM(AO20:AQ20))","v":0},"--",0,{"$f":"SUM(Table_2[[#This Row],[Column20]],Table_2[[#This Row],[Column19]],Table_2[[#This Row],[Column18]])","v":0},"HEALTH & PHY. EDU.",{"$f":"(M20/Instructions!$C$23)*100","v":0},{"$f":"(P20/Instructions!$C$24)*100","v":0},{"$f":"(S20/Instructions!$C$25)*100","v":0},{"$f":"(V20/Instructions!$C$26)*100","v":0},{"$f":"(Y20/Instructions!$C$27)*100","v":0},{"$f":"(AB20/Instructions!$C$28)*100","v":0},{"$f":"(AF20/Instructions!$C$29)*100","v":0},{"$f":"(AJ20/Instructions!$C$30)*100","v":0},{"$f":"(AN20/Instructions!$C$31)*100","v":0},0,{"$f":"(AS20/Instructions!$C$33)*100","v":{"$error":"#VALUE!"}},"----","E","E","E","E","E","E","E","E","E","E","--","E",null,null,null,null,{"$f":"Table_2[[#This Row],[Column51]]&Table_2[[#This Row],[Column52]]&BU22","v":""}]
[19,null,null,null,null,null,null,null,null,null,null,null,0,null,null,0,null,null,0,null,null,0,null,null,0,null,null,0,null,null,null,0,null,null,null,{"$f":"IF(AG21<Instructions!D50,AG21,SUM(AG21:AI21))","v":0},null,null,null,{"$f":"IF(AK21<Instructions!D49,AK21,SUM(AK21:AM21))","v":0},null,null,null,{"$f":"IF(AO21<Instructions!D48,AO21,SUM(AO21:AQ21))","v":0},"--",0,{"$f":"SUM(Table_2[[#This Row],[Column20]],Table_2[[#This Row],[Column19]],Table_2[[#This Row],[Column18]])","v":0},"HEALTH & PHY. EDU.",{"$f":"(M21/Instructions!$C$23)*100","v":0},{"$f":"(P21/Instructions!$C$24)*100","v":0},{"$f":"(S21/Instructions!$C$25)*100","v":0},{"$f":"(V21/Instructions!$C$26)*100","v":0},{"$f":"(Y21/Instructions!$C$27)*100","v":0},{"$f":"(AB21/Instructions!$C$28)*100","v":0},{"$f":"(AF21/Instructions!$C$29)*100","v":0},{"$f":"(AJ21/Instructions!$C$30)*100","v":0},{"$f":"(AN21/Instructions!$C$31)*100","v":0},0,{"$f":"(AS21/Instructions!$C$33)*100","v":{"$error":"#VALUE!"}},"----","E","E","E","E","E","E","E","E","E","E","--","E",null,null,null,null,{"$f":"Table_2[[#This Row],[Column51]]&Table_2[[#This Row],[Column52]]&BU23","v":""}]
[20,null,null,null,null,null,null,null,null,null,null,null,0,null,null,0,null,null,0,null,null,0,null,null,0,null,null,0,null,null,null,0,null,null,null,{"$f":"IF(AG22<Instructions!D51,AG22,SUM(AG22:AI22))","v":0},null,null,null,{"$f":"IF(AK22<Instructions!D50,AK22,SUM(AK22:AM22))","v":0},null,null,null,{"$f":"IF(AO22<Instructions!D49,AO22,SUM(AO22:AQ22))","v":0},"--",0,{"$f":"SUM(Table_2[[#This Row],[Column20]],Table_2[[#This Row],[Column19]],Table_2[[#This Row],[Column18]])","v":0},"HEALTH & PHY. EDU.",{"$f":"(M22/Instructions!$C$23)*100","v":0},{"$f":"(P22/Instructions!$C$24)*100","v":0},{"$f":"(S22/Instructions!$C$25)*100","v":0},{"$f":"(V22/Instructions!$C$26)*100","v":0},{"$f":"(Y22/Instructions!$C$27)*100","v":0},{"$f":"(AB22/Instructions!$C$28)*100","v":0},{"$f":"(AF22/Instructions!$C$29)*100","v":0},{"$f":"(AJ22/Instructions!$C$30)*100","v":0},{"$f":"(AN22/Instructions!$C$31)*100","v":0},0,{"$f":"(AS22/Instructions!$C$33)*100","v":{"$error":"#VALUE!"}},"----","E","E","E","E","E","E","E","E","E","E","--","E",null,null,null,null,{"$f":"Table_2[[#This Row],[Column51]]&Table_2[[#This Row],[Column52]]&BU24","v":""}]
[21,null,null,null,null,null,null,null,null,null,null,null,0,null,null,0,null,null,0,null,null,0,null,null,0,null,null,0,null,null,null,0,null,null,null,{"$f":"IF(AG23<Instructions!D52,AG23,SUM(AG23:AI23))","v":0},null,null,null,{"$f":"IF(AK23<Instructions!D51,AK23,SUM(AK23:AM23))","v":0},null,null,null,{"$f":"IF(AO23<Instructions!D50,AO23,SUM(AO23:AQ23))","v":0},"--",0,{"$f":"SUM(Table_2[[#This Row],[Column20]],Table_2[[#This Row],[Column19]],Table_2[[#This Row],[Column18]])","v":0},"HEALTH & PHY. EDU.",{"$f":"(M23/Instructions!$C$23)*100","v":0},{"$f":"(P23/Instructions!$C$24)*100","v":0},{"$f":"(S23/Instructions!$C$25)*100","v":0},{"$f":"(V23/Instructions!$C$26)*100","v":0},{"$f":"(Y23/Instructions!$C$27)*100","v":0},{"$f":"(AB23/Instructions!$C$28)*100","v":0},{"$f":"(AF23/Instructions!$C$29)*100","v":0},{"$f":"(AJ23/Instructions!$C$30)*100","v":0},{"$f":"(AN23/Instructions!$C$31)*100","v":0},0,{"$f":"(AS23/Instructions!$C$33)*100","v":{"$error":"#VALUE!"}},"----","E","E","E","E","E","E","E","E","E","E","--","E",null,null,null,null,{"$f":"Table_2[[#This Row],[Column51]]&Table_2[[#This Row],[Column52]]&BU25","v":""}]
[22,null,null,null,null,null,null,null,null,null,null,null,0,null,null,0,null,null,0,null,null,0,null,null,0,null,null,0,null,null,null,0,null,null,null,{"$f":"IF(AG24<Instructions!D53,AG24,SUM(AG24:AI24))","v":0},null,null,null,{"$f":"IF(AK24<Instructions!D52,AK24,SUM(AK24:AM24))","v":0},null,null,null,{"$f":"IF(AO24<Instructions!D51,AO24,SUM(AO24:AQ24))","v":0},"--",0,{"$f":"SUM(Table_2[[#This Row],[Column20]],Table_2[[#This Row],[Column19]],Table_2[[#This Row],[Column18]])","v":0},"HEALTH & PHY. EDU.",{"$f":"(M24/Instructions!$C$23)*100","v":0},{"$f":"(P24/Instructions!$C$24)*100","v":0},{"$f":"(S24/Instructions!$C$25)*100","v":0},{"$f":"(V24/Instructions!$C$26)*100","v":0},{"$f":"(Y24/Instructions!$C$27)*100","v":0},{"$f":"(AB24/Instructions!$C$28)*100","v":0},{"$f":"(AF24/Instructions!$C$29)*100","v":0},{"$f":"(AJ24/Instructions!$C$30)*100","v":0},{"$f":"(AN24/Instructions!$C$31)*100","v":0},0,{"$f":"(AS24/Instructions!$C$33)*100","v":{"$error":"#VALUE!"}},"----","E","E","E","E","E","E","E","E","E","E","--","E",null,null,null,null,{"$f":"Table_2[[#This Row],[Column51]]&Table_2[[#This Row],[Column52]]&BU26","v":""}]
[23,null,null,null,null,null,null,null,null,null,null,null,0,null,null,0,null,null,0,null,null,0,null,null,0,null,null,0,null,null,null,0,null,null,null,{"$f":"IF(AG25<Instructions!D54,AG25,SUM(AG25:AI25))","v":0},null,null,null,{"$f":"IF(AK25<Instructions!D53,AK25,SUM(AK25:AM25))","v":0},null,null,null,{"$f":"IF(AO25<Instructions!D52,AO25,SUM(AO25:AQ25))","v":0},"--",0,{"$f":"SUM(Table_2[[#This Row],[Column20]],Table_2[[#This Row],[Column19]],Table_2[[#This Row],[Column18]])","v":0},"HEALTH & PHY. EDU.",{"$f":"(M25/Instructions!$C$23)*100","v":0},{"$f":"(P25/Instructions!$C$24)*100","v":0},{"$f":"(S25/Instructions!$C$25)*100","v":0},{"$f":"(V25/Instructions!$C$26)*100","v":0},{"$f":"(Y25/Instructions!$C$27)*100","v":0},{"$f":"(AB25/Instructions!$C$28)*100","v":0},{"$f":"(AF25/Instructions!$C$29)*100","v":0},{"$f":"(AJ25/Instructions!$C$30)*100","v":0},{"$f":"(AN25/Instructions!$C$31)*100","v":0},0,{"$f":"(AS25/Instructions!$C$33)*100","v":{"$error":"#VALUE!"}},"----","E","E","E","E","E","E","E","E","E","E","--","E",null,null,null,null,{"$f":"Table_2[[#This Row],[Column51]]&Table_2[[#This Row],[Column52]]&BU27","v":""}]
[24,null,null,null,null,null,null,null,null,null,null,null,0,null,null,0,null,null,0,null,null,0,null,null,0,null,null,0,null,null,null,0,null,null,null,{"$f":"IF(AG26<Instructions!D55,AG26,SUM(AG26:AI26))","v":0},null,null,null,{"$f":"IF(AK26<Instructions!D54,AK26,SUM(AK26:AM26))","v":0},null,null,null,{"$f":"IF(AO26<Instructions!D53,AO26,SUM(AO26:AQ26))","v":0},"--",0,{"$f":"SUM(Table_2[[#This Row],[Column20]],Table_2[[#This Row],[Column19]],Table_2[[#This Row],[Column18]])","v":0},"HEALTH & PHY. EDU.",{"$f":"(M26/Instructions!$C$23)*100","v":0},{"$f":"(P26/Instructions!$C$24)*100","v":0},{"$f":"(S26/Instructions!$C$25)*100","v":0},{"$f":"(V26/Instructions!$C$26)*100","v":0},{"$f":"(Y26/Instructions!$C$27)*100","v":0},{"$f":"(AB26/Instructions!$C$28)*100","v":0},{"$f":"(AF26/Instructions!$C$29)*100","v":0},{"$f":"(AJ26/Instructions!$C$30)*100","v":0},{"$f":"(AN26/Instructions!$C$31)*100","v":0},0,{"$f":"(AS26/Instructions!$C$33)*100","v":{"$error":"#VALUE!"}},"----","E","E","E","E","E","E","E","E","E","E","--","E",null,null,null,null,{"$f":"Table_2[[#This Row],[Column51]]&Table_2[[#This Row],[Column52]]&BU28","v":""}]
[25,null,null,null,null,null,null,null,null,null,null,null,0,null,null,0,null,null,0,null,null,0,null,null,0,null,null,0,null,null,null,0,null,null,null,{"$f":"IF(AG27<Instructions!D56,AG27,SUM(AG27:AI27))","v":0},null,null,null,{"$f":"IF(AK27<Instructions!D55,AK27,SUM(AK27:AM27))","v":0},null,null,null,{"$f":"IF(AO27<Instructions!D54,AO27,SUM(AO27:AQ27))","v":0},"--",0,{"$f":"SUM(Table_2[[#This Row],[Column20]],Table_2[[#This Row],[Column19]],Table_2[[#This Row],[Column18]])","v":0},"HEALTH & PHY. EDU.",{"$f":"(M27/Instructions!$C$23)*100","v":0},{"$f":"(P27/Instructions!$C$24)*100","v":0},{"$f":"(S27/Instructions!$C$25)*100","v":0},{"$f":"(V27/Instructions!$C$26)*100","v":0},{"$f":"(Y27/Instructions!$C$27)*100","v":0},{"$f":"(AB27/Instructions!$C$28)*100","v":0},{"$f":"(AF27/Instructions!$C$29)*100","v":0},{"$f":"(AJ27/Instructions!$C$30)*100","v":0},{"$f":"(AN27/Instructions!$C$31)*100","v":0},0,{"$f":"(AS27/Instructions!$C$33)*100","v":{"$error":"#VALUE!"}},"----","E","E","E","E","E","E","E","E","E","E","--","E",null,null,null,null,{"$f":"Table_2[[#This Row],[Column51]]&Table_2[[#This Row],[Column52]]&BU29","v":""}]
[26,null,null,null,null,null,null,null,null,null,null,null,0,null,null,0,null,null,0,null,null,0,null,null,0,null,null,0,null,null,null,0,null,null,null,{"$f":"IF(AG28<Instructions!D57,AG28,SUM(AG28:AI28))","v":0},null,null,null,{"$f":"IF(AK28<Instructions!D56,AK28,SUM(AK28:AM28))","v":0},null,null,null,{"$f":"IF(AO28<Instructions!D55,AO28,SUM(AO28:AQ28))","v":0},"--",0,{"$f":"SUM(Table_2[[#This Row],[Column20]],Table_2[[#This Row],[Column19]],Table_2[[#This Row],[Column18]])","v":0},"HEALTH & PHY. EDU.",{"$f":"(M28/Instructions!$C$23)*100","v":0},{"$f":"(P28/Instructions!$C$24)*100","v":0},{"$f":"(S28/Instructions!$C$25)*100","v":0},{"$f":"(V28/Instructions!$C$26)*100","v":0},{"$f":"(Y28/Instructions!$C$27)*100","v":0},{"$f":"(AB28/Instructions!$C$28)*100","v":0},{"$f":"(AF28/Instructions!$C$29)*100","v":0},{"$f":"(AJ28/Instructions!$C$30)*100","v":0},{"$f":"(AN28/Instructions!$C$31)*100","v":0},0,{"$f":"(AS28/Instructions!$C$33)*100","v":{"$error":"#VALUE!"}},"----","E","E","E","E","E","E","E","E","E","E","--","E",null,null,null,null,{"$f":"Table_2[[#This Row],[Column51]]&Table_2[[#This Row],[Column52]]&BU30","v":""}]
[27,null,null,null,null,null,null,null,null,null,null,null,0,null,null,0,null,null,0,null,null,0,null,null,0,null,null,0,null,null,null,0,null,null,null,{"$f":"IF(AG29<Instructions!D58,AG29,SUM(AG29:AI29))","v":0},null,null,null,{"$f":"IF(AK29<Instructions!D57,AK29,SUM(AK29:AM29))","v":0},null,null,null,{"$f":"IF(AO29<Instructions!D56,AO29,SUM(AO29:AQ29))","v":0},"--",0,{"$f":"SUM(Table_2[[#This Row],[Column20]],Table_2[[#This Row],[Column19]],Table_2[[#This Row],[Column18]])","v":0},"HEALTH & PHY. EDU.",{"$f":"(M29/Instructions!$C$23)*100","v":0},{"$f":"(P29/Instructions!$C$24)*100","v":0},{"$f":"(S29/Instructions!$C$25)*100","v":0},{"$f":"(V29/Instructions!$C$26)*100","v":0},{"$f":"(Y29/Instructions!$C$27)*100","v":0},{"$f":"(AB29/Instructions!$C$28)*100","v":0},{"$f":"(AF29/Instructions!$C$29)*100","v":0},{"$f":"(AJ29/Instructions!$C$30)*100","v":0},{"$f":"(AN29/Instructions!$C$31)*100","v":0},0,{"$f":"(AS29/Instructions!$C$33)*100","v":{"$error":"#VALUE!"}},"----","E","E","E","E","E","E","E","E","E","E","--","E",null,null,null,null,{"$f":"Table_2[[#This Row],[Column51]]&Table_2[[#This Row],[Column52]]&BU31","v":""}]
[28,null,null,null,null,null,null,null,null,null,null,null,0,null,null,0,null,null,0,null,null,0,null,null,0,null,null,0,null,null,null,0,null,null,null,{"$f":"IF(AG30<Instructions!D59,AG30,SUM(AG30:AI30))","v":0},null,null,null,{"$f":"IF(AK30<Instructions!D58,AK30,SUM(AK30:AM30))","v":0},null,null,null,{"$f":"IF(AO30<Instructions!D57,AO30,SUM(AO30:AQ30))","v":0},"--",0,{"$f":"SUM(Table_2[[#This Row],[Column20]],Table_2[[#This Row],[Column19]],Table_2[[#This Row],[Column18]])","v":0},"HEALTH & PHY. EDU.",{"$f":"(M30/Instructions!$C$23)*100","v":0},{"$f":"(P30/Instructions!$C$24)*100","v":0},{"$f":"(S30/Instructions!$C$25)*100","v":0},{"$f":"(V30/Instructions!$C$26)*100","v":0},{"$f":"(Y30/Instructions!$C$27)*100","v":0},{"$f":"(AB30/Instructions!$C$28)*100","v":0},{"$f":"(AF30/Instructions!$C$29)*100","v":0},{"$f":"(AJ30/Instructions!$C$30)*100","v":0},{"$f":"(AN30/Instructions!$C$31)*100","v":0},0,{"$f":"(AS30/Instructions!$C$33)*100","v":{"$error":"#VALUE!"}},"----","E","E","E","E","E","E","E","E","E","E","--","E",null,null,null,null,{"$f":"Table_2[[#This Row],[Column51]]&Table_2[[#This Row],[Column52]]&BU32","v":""}]
[29,null,null,null,null,null,null,null,null,null,null,null,0,null,null,0,null,null,0,null,null,0,null,null,0,null,null,0,null,null,null,0,null,null,null,{"$f":"IF(AG31<Instructions!D60,AG31,SUM(AG31:AI31))","v":0},null,null,null,{"$f":"IF(AK31<Instructions!D59,AK31,SUM(AK31:AM31))","v":0},null,null,null,{"$f":"IF(AO31<Instructions!D58,AO31,SUM(AO31:AQ31))","v":0},"--",0,{"$f":"SUM(Table_2[[#This Row],[Column20]],Table_2[[#This Row],[Column19]],Table_2[[#This Row],[Column18]])","v":0},"HEALTH & PHY. EDU.",{"$f":"(M31/Instructions!$C$23)*100","v":0},{"$f":"(P31/Instructions!$C$24)*100","v":0},{"$f":"(S31/Instructions!$C$25)*100","v":0},{"$f":"(V31/Instructions!$C$26)*100","v":0},{"$f":"(Y31/Instructions!$C$27)*100","v":0},{"$f":"(AB31/Instructions!$C$28)*100","v":0},{"$f":"(AF31/Instructions!$C$29)*100","v":0},{"$f":"(AJ31/Instructions!$C$30)*100","v":0},{"$f":"(AN31/Instructions!$C$31)*100","v":0},0,{"$f":"(AS31/Instructions!$C$33)*100","v":{"$error":"#VALUE!"}},"----","E","E","E","E","E","E","E","E","E","E","--","E",null,null,null,null,{"$f":"Table_2[[#This Row],[Column51]]&Table_2[[#This Row],[Column52]]&BU33","v":""}]
[30,null,null,null,null,null,null,null,null,null,null,null,0,null,null,0,null,null,0,null,null,0,null,null,0,null,null,0,null,null,null,0,null,null,null,{"$f":"IF(AG32<Instructions!D61,AG32,SUM(AG32:AI32))","v":0},null,null,null,{"$f":"IF(AK32<Instructions!D60,AK32,SUM(AK32:AM32))","v":0},null,null,null,{"$f":"IF(AO32<Instructions!D59,AO32,SUM(AO32:AQ32))","v":0},"--",0,{"$f":"SUM(Table_2[[#This Row],[Column20]],Table_2[[#This Row],[Column19]],Table_2[[#This Row],[Column18]])","v":0},"HEALTH & PHY. EDU.",{"$f":"(M32/Instructions!$C$23)*100","v":0},{"$f":"(P32/Instructions!$C$24)*100","v":0},{"$f":"(S32/Instructions!$C$25)*100","v":0},{"$f":"(V32/Instructions!$C$26)*100","v":0},{"$f":"(Y32/Instructions!$C$27)*100","v":0},{"$f":"(AB32/Instructions!$C$28)*100","v":0},{"$f":"(AF32/Instructions!$C$29)*100","v":0},{"$f":"(AJ32/Instructions!$C$30)*100","v":0},{"$f":"(AN32/Instructions!$C$31)*100","v":0},0,{"$f":"(AS32/Instructions!$C$33)*100","v":{"$error":"#VALUE!"}},"----","E","E","E","E","E","E","E","E","E","E","--","E",null,null,null,null,{"$f":"Table_2[[#This Row],[Column51]]&Table_2[[#This Row],[Column52]]&BU34","v":""}]
[31,null,null,null,null,null,null,null,null,null,null,null,0,null,null,0,null,null,0,null,null,0,null,null,0,null,null,0,null,null,null,0,null,null,null,{"$f":"IF(AG33<Instructions!D62,AG33,SUM(AG33:AI33))","v":0},null,null,null,{"$f":"IF(AK33<Instructions!D61,AK33,SUM(AK33:AM33))","v":0},null,null,null,{"$f":"IF(AO33<Instructions!D60,AO33,SUM(AO33:AQ33))","v":0},"--",0,{"$f":"SUM(Table_2[[#This Row],[Column20]],Table_2[[#This Row],[Column19]],Table_2[[#This Row],[Column18]])","v":0},"HEALTH & PHY. EDU.",{"$f":"(M33/Instructions!$C$23)*100","v":0},{"$f":"(P33/Instructions!$C$24)*100","v":0},{"$f":"(S33/Instructions!$C$25)*100","v":0},{"$f":"(V33/Instructions!$C$26)*100","v":0},{"$f":"(Y33/Instructions!$C$27)*100","v":0},{"$f":"(AB33/Instructions!$C$28)*100","v":0},{"$f":"(AF33/Instructions!$C$29)*100","v":0},{"$f":"(AJ33/Instructions!$C$30)*100","v":0},{"$f":"(AN33/Instructions!$C$31)*100","v":0},0,{"$f":"(AS33/Instructions!$C$33)*100","v":{"$error":"#VALUE!"}},"----","E","E","E","E","E","E","E","E","E","E","--","E",null,null,null,null,{"$f":"Table_2[[#This Row],[Column51]]&Table_2[[#This Row],[Column52]]&BU35","v":""}]
[32,null,null,null,null,null,null,null,null,null,null,null,0,null,null,0,null,null,0,null,null,0,null,null,0,null,null,0,null,null,null,0,null,null,null,{"$f":"IF(AG34<Instructions!D63,AG34,SUM(AG34:AI34))","v":0},null,null,null,{"$f":"IF(AK34<Instructions!D62,AK34,SUM(AK34:AM34))","v":0},null,null,null,{"$f":"IF(AO34<Instructions!D61,AO34,SUM(AO34:AQ34))","v":0},"--",0,{"$f":"SUM(Table_2[[#This Row],[Column20]],Table_2[[#This Row],[Column19]],Table_2[[#This Row],[Column18]])","v":0},"HEALTH & PHY. EDU.",{"$f":"(M34/Instructions!$C$23)*100","v":0},{"$f":"(P34/Instructions!$C$24)*100","v":0},{"$f":"(S34/Instructions!$C$25)*100","v":0},{"$f":"(V34/Instructions!$C$26)*100","v":0},{"$f":"(Y34/Instructions!$C$27)*100","v":0},{"$f":"(AB34/Instructions!$C$28)*100","v":0},{"$f":"(AF34/Instructions!$C$29)*100","v":0},{"$f":"(AJ34/Instructions!$C$30)*100","v":0},{"$f":"(AN34/Instructions!$C$31)*100","v":0},0,{"$f":"(AS34/Instructions!$C$33)*100","v":{"$error":"#VALUE!"}},"----","E","E","E","E","E","E","E","E","E","E","--","E",null,null,null,null,{"$f":"Table_2[[#This Row],[Column51]]&Table_2[[#This Row],[Column52]]&BU36","v":""}]
[33,null,null,null,null,null,null,null,null,null,null,null,0,null,null,0,null,null,0,null,null,0,null,null,0,null,null,0,null,null,null,0,null,null,null,{"$f":"IF(AG35<Instructions!D64,AG35,SUM(AG35:AI35))","v":0},null,null,null,{"$f":"IF(AK35<Instructions!D63,AK35,SUM(AK35:AM35))","v":0},null,null,null,{"$f":"IF(AO35<Instructions!D62,AO35,SUM(AO35:AQ35))","v":0},"--",0,{"$f":"SUM(Table_2[[#This Row],[Column20]],Table_2[[#This Row],[Column19]],Table_2[[#This Row],[Column18]])","v":0},"HEALTH & PHY. EDU.",{"$f":"(M35/Instructions!$C$23)*100","v":0},{"$f":"(P35/Instructions!$C$24)*100","v":0},{"$f":"(S35/Instructions!$C$25)*100","v":0},{"$f":"(V35/Instructions!$C$26)*100","v":0},{"$f":"(Y35/Instructions!$C$27)*100","v":0},{"$f":"(AB35/Instructions!$C$28)*100","v":0},{"$f":"(AF35/Instructions!$C$29)*100","v":0},{"$f":"(AJ35/Instructions!$C$30)*100","v":0},{"$f":"(AN35/Instructions!$C$31)*100","v":0},0,{"$f":"(AS35/Instructions!$C$33)*100","v":{"$error":"#VALUE!"}},"----","E","E",{"$f":"IFERROR(IF(AY35>90,\"A+\",IF(AY35>80,\"A\",IF(AY35>70,\"B+\",IF(AY35>60,\"B\",IF(AY35>50,\"C+\",IF(AY35>40,\"C\",IF(AY35>=33,\"D\",\"E\"))))))),\"Abs\")","v":"E"},"E","E","E","E","E","E","E","--","E",null,null,null,null,{"$f":"Table_2[[#This Row],[Column51]]&Table_2[[#This Row],[Column52]]&BU37","v":""}]
[34,null,null,null,null,null,null,null,null,null,null,null,0,null,null,0,null,null,0,null,null,0,null,null,0,null,null,0,null,null,null,0,null,null,null,{"$f":"IF(AG36<Instructions!D65,AG36,SUM(AG36:AI36))","v":0},null,null,null,{"$f":"IF(AK36<Instructions!D64,AK36,SUM(AK36:AM36))","v":0},null,null,null,{"$f":"IF(AO36<Instructions!D63,AO36,SUM(AO36:AQ36))","v":0},"--",0,{"$f":"SUM(Table_2[[#This Row],[Column20]],Table_2[[#This Row],[Column19]],Table_2[[#This Row],[Column18]])","v":0},"HEALTH & PHY. EDU.",{"$f":"(M36/Instructions!$C$23)*100","v":0},{"$f":"(P36/Instructions!$C$24)*100","v":0},{"$f":"(S36/Instructions!$C$25)*100","v":0},{"$f":"(V36/Instructions!$C$26)*100","v":0},{"$f":"(Y36/Instructions!$C$27)*100","v":0},{"$f":"(AB36/Instructions!$C$28)*100","v":0},{"$f":"(AF36/Instructions!$C$29)*100","v":0},{"$f":"(AJ36/Instructions!$C$30)*100","v":0},{"$f":"(AN36/Instructions!$C$31)*100","v":0},0,{"$f":"(AS36/Instructions!$C$33)*100","v":{"$error":"#VALUE!"}},"----","E","E","E","E","E","E","E","E","E","E","--","E",null,null,null,null,{"$f":"Table_2[[#This Row],[Column51]]&Table_2[[#This Row],[Column52]]&BU38","v":""}]
[35,null,null,null,null,null,null,null,null,null,null,null,0,null,null,0,null,null,0,null,null,0,null,null,0,null,null,0,null,null,null,0,null,null,null,{"$f":"IF(AG37<Instructions!D66,AG37,SUM(AG37:AI37))","v":0},null,null,null,{"$f":"IF(AK37<Instructions!D65,AK37,SUM(AK37:AM37))","v":0},null,null,null,{"$f":"IF(AO37<Instructions!D64,AO37,SUM(AO37:AQ37))","v":0},"--",0,{"$f":"SUM(Table_2[[#This Row],[Column20]],Table_2[[#This Row],[Column19]],Table_2[[#This Row],[Column18]])","v":0},"HEALTH & PHY. EDU.",{"$f":"(M37/Instructions!$C$23)*100","v":0},{"$f":"(P37/Instructions!$C$24)*100","v":0},{"$f":"(S37/Instructions!$C$25)*100","v":0},{"$f":"(V37/Instructions!$C$26)*100","v":0},{"$f":"(Y37/Instructions!$C$27)*100","v":0},{"$f":"(AB37/Instructions!$C$28)*100","v":0},{"$f":"(AF37/Instructions!$C$29)*100","v":0},{"$f":"(AJ37/Instructions!$C$30)*100","v":0},{"$f":"(AN37/Instructions!$C$31)*100","v":0},0,{"$f":"(AS37/Instructions!$C$33)*100","v":{"$error":"#VALUE!"}},"----","E","E","E","E","E","E","E","E","E","E","--","E",null,null,null,null,{"$f":"Table_2[[#This Row],[Column51]]&Table_2[[#This Row],[Column52]]&BU39","v":""}]
[36,null,null,null,null,null,null,null,null,null,null,null,0,null,null,0,null,null,0,null,null,0,null,null,0,null,null,0,null,null,null,0,null,null,null,{"$f":"IF(AG38<Instructions!D67,AG38,SUM(AG38:AI38))","v":0},null,null,null,{"$f":"IF(AK38<Instructions!D66,AK38,SUM(AK38:AM38))","v":0},null,null,null,{"$f":"IF(AO38<Instructions!D65,AO38,SUM(AO38:AQ38))","v":0},"--",0,{"$f":"SUM(Table_2[[#This Row],[Column20]],Table_2[[#This Row],[Column19]],Table_2[[#This Row],[Column18]])","v":0},"HEALTH & PHY. EDU.",{"$f":"(M38/Instructions!$C$23)*100","v":0},{"$f":"(P38/Instructions!$C$24)*100","v":0},{"$f":"(S38/Instructions!$C$25)*100","v":0},{"$f":"(V38/Instructions!$C$26)*100","v":0},{"$f":"(Y38/Instructions!$C$27)*100","v":0},{"$f":"(AB38/Instructions!$C$28)*100","v":0},{"$f":"(AF38/Instructions!$C$29)*100","v":0},{"$f":"(AJ38/Instructions!$C$30)*100","v":0},{"$f":"(AN38/Instructions!$C$31)*100","v":0},0,{"$f":"(AS38/Instructions!$C$33)*100","v":{"$error":"#VALUE!"}},"----","E","E","E","E","E","E","E","E","E","E","--","E",null,null,null,null,{"$f":"Table_2[[#This Row],[Column51]]&Table_2[[#This Row],[Column52]]&BU40","v":""}]
[37,null,null,null,null,null,null,null,null,null,null,null,0,null,null,0,null,null,0,null,null,0,null,null,0,null,null,0,null,null,null,0,null,null,null,{"$f":"IF(AG39<Instructions!D68,AG39,SUM(AG39:AI39))","v":0},null,null,null,{"$f":"IF(AK39<Instructions!D67,AK39,SUM(AK39:AM39))","v":0},null,null,null,{"$f":"IF(AO39<Instructions!D66,AO39,SUM(AO39:AQ39))","v":0},"--",0,{"$f":"SUM(Table_2[[#This Row],[Column20]],Table_2[[#This Row],[Column19]],Table_2[[#This Row],[Column18]])","v":0},"HEALTH & PHY. EDU.",{"$f":"(M39/Instructions!$C$23)*100","v":0},{"$f":"(P39/Instructions!$C$24)*100","v":0},{"$f":"(S39/Instructions!$C$25)*100","v":0},{"$f":"(V39/Instructions!$C$26)*100","v":0},{"$f":"(Y39/Instructions!$C$27)*100","v":0},{"$f":"(AB39/Instructions!$C$28)*100","v":0},{"$f":"(AF39/Instructions!$C$29)*100","v":0},{"$f":"(AJ39/Instructions!$C$30)*100","v":0},{"$f":"(AN39/Instructions!$C$31)*100","v":0},0,{"$f":"(AS39/Instructions!$C$33)*100","v":{"$error":"#VALUE!"}},"----","E","E","E","E","E","E","E","E","E","E","--","E",null,null,null,null,{"$f":"Table_2[[#This Row],[Column51]]&Table_2[[#This Row],[Column52]]&BU41","v":""}]
[38,null,null,null,null,null,null,null,null,null,null,null,0,null,null,0,null,null,0,null,null,0,null,null,0,null,null,0,null,null,null,0,null,null,null,{"$f":"IF(AG40<Instructions!D69,AG40,SUM(AG40:AI40))","v":0},null,null,null,{"$f":"IF(AK40<Instructions!D68,AK40,SUM(AK40:AM40))","v":0},null,null,null,{"$f":"IF(AO40<Instructions!D67,AO40,SUM(AO40:AQ40))","v":0},"--",0,{"$f":"SUM(Table_2[[#This Row],[Column20]],Table_2[[#This Row],[Column19]],Table_2[[#This Row],[Column18]])","v":0},"HEALTH & PHY. EDU.",{"$f":"(M40/Instructions!$C$23)*100","v":0},{"$f":"(P40/Instructions!$C$24)*100","v":0},{"$f":"(S40/Instructions!$C$25)*100","v":0},{"$f":"(V40/Instructions!$C$26)*100","v":0},{"$f":"(Y40/Instructions!$C$27)*100","v":0},{"$f":"(AB40/Instructions!$C$28)*100","v":0},{"$f":"(AF40/Instructions!$C$29)*100","v":0},{"$f":"(AJ40/Instructions!$C$30)*100","v":0},{"$f":"(AN40/Instructions!$C$31)*100","v":0},0,{"$f":"(AS40/Instructions!$C$33)*100","v":{"$error":"#VALUE!"}},"----","E","E","E","E","E","E","E","E","E","E","--","E",null,null,null,null,{"$f":"Table_2[[#This Row],[Column51]]&Table_2[[#This Row],[Column52]]&BU42","v":""}]
[39,null,null,null,null,null,null,null,null,null,null,null,0,null,null,0,null,null,0,null,null,0,null,null,0,null,null,0,null,null,null,0,null,null,null,{"$f":"IF(AG41<Instructions!D70,AG41,SUM(AG41:AI41))","v":0},null,null,null,{"$f":"IF(AK41<Instructions!D69,AK41,SUM(AK41:AM41))","v":0},null,null,null,{"$f":"IF(AO41<Instructions!D68,AO41,SUM(AO41:AQ41))","v":0},"--",0,{"$f":"SUM(Table_2[[#This Row],[Column20]],Table_2[[#This Row],[Column19]],Table_2[[#This Row],[Column18]])","v":0},"HEALTH & PHY. EDU.",{"$f":"(M41/Instructions!$C$23)*100","v":0},{"$f":"(P41/Instructions!$C$24)*100","v":0},{"$f":"(S41/Instructions!$C$25)*100","v":0},{"$f":"(V41/Instructions!$C$26)*100","v":0},{"$f":"(Y41/Instructions!$C$27)*100","v":0},{"$f":"(AB41/Instructions!$C$28)*100","v":0},{"$f":"(AF41/Instructions!$C$29)*100","v":0},{"$f":"(AJ41/Instructions!$C$30)*100","v":0},{"$f":"(AN41/Instructions!$C$31)*100","v":0},0,{"$f":"(AS41/Instructions!$C$33)*100","v":{"$error":"#VALUE!"}},"----","E","E","E","E","E","E","E","E","E","E","--","E",null,null,null,null,{"$f":"Table_2[[#This Row],[Column51]]&Table_2[[#This Row],[Column52]]&BU43","v":""}]
[40,null,null,null,null,null,null,null,null,null,null,null,0,null,null,0,null,null,0,null,null,0,null,null,0,null,null,0,null,null,null,0,null,null,null,{"$f":"IF(AG42<Instructions!D71,AG42,SUM(AG42:AI42))","v":0},null,null,null,{"$f":"IF(AK42<Instructions!D70,AK42,SUM(AK42:AM42))","v":0},null,null,null,{"$f":"IF(AO42<Instructions!D69,AO42,SUM(AO42:AQ42))","v":0},"--",0,{"$f":"SUM(Table_2[[#This Row],[Column20]],Table_2[[#This Row],[Column19]],Table_2[[#This Row],[Column18]])","v":0},"HEALTH & PHY. EDU.",{"$f":"(M42/Instructions!$C$23)*100","v":0},{"$f":"(P42/Instructions!$C$24)*100","v":0},{"$f":"(S42/Instructions!$C$25)*100","v":0},{"$f":"(V42/Instructions!$C$26)*100","v":0},{"$f":"(Y42/Instructions!$C$27)*100","v":0},{"$f":"(AB42/Instructions!$C$28)*100","v":0},{"$f":"(AF42/Instructions!$C$29)*100","v":0},{"$f":"(AJ42/Instructions!$C$30)*100","v":0},{"$f":"(AN42/Instructions!$C$31)*100","v":0},0,{"$f":"(AS42/Instructions!$C$33)*100","v":{"$error":"#VALUE!"}},"----","E","E","E","E","E","E","E","E","E","E","--","E",null,null,null,null,{"$f":"Table_2[[#This Row],[Column51]]&Table_2[[#This Row],[Column52]]&BU44","v":""}]
[41,null,null,null,null,null,null,null,null,null,null,null,0,null,null,0,null,null,0,null,null,0,null,null,0,null,null,0,null,null,null,0,null,null,null,{"$f":"IF(AG43<Instructions!D72,AG43,SUM(AG43:AI43))","v":0},null,null,null,{"$f":"IF(AK43<Instructions!D71,AK43,SUM(AK43:AM43))","v":0},null,null,null,{"$f":"IF(AO43<Instructions!D70,AO43,SUM(AO43:AQ43))","v":0},"--",0,{"$f":"SUM(Table_2[[#This Row],[Column20]],Table_2[[#This Row],[Column19]],Table_2[[#This Row],[Column18]])","v":0},"HEALTH & PHY. EDU.",{"$f":"(M43/Instructions!$C$23)*100","v":0},{"$f":"(P43/Instructions!$C$24)*100","v":0},{"$f":"(S43/Instructions!$C$25)*100","v":0},{"$f":"(V43/Instructions!$C$26)*100","v":0},{"$f":"(Y43/Instructions!$C$27)*100","v":0},{"$f":"(AB43/Instructions!$C$28)*100","v":0},{"$f":"(AF43/Instructions!$C$29)*100","v":0},{"$f":"(AJ43/Instructions!$C$30)*100","v":0},{"$f":"(AN43/Instructions!$C$31)*100","v":0},0,{"$f":"(AS43/Instructions!$C$33)*100","v":{"$error":"#VALUE!"}},"----","E","E","E","E","E","E","E","E","E","E","--","E",null,null,null,null,{"$f":"Table_2[[#This Row],[Column51]]&Table_2[[#This Row],[Column52]]&BU45","v":""}]
[42,null,null,null,null,null,null,null,null,null,null,null,0,null,null,0,null,null,0,null,null,0,null,null,0,null,null,0,null,null,null,0,null,null,null,{"$f":"IF(AG44<Instructions!D73,AG44,SUM(AG44:AI44))","v":0},null,null,null,{"$f":"IF(AK44<Instructions!D72,AK44,SUM(AK44:AM44))","v":0},null,null,null,{"$f":"IF(AO44<Instructions!D71,AO44,SUM(AO44:AQ44))","v":0},"--",0,{"$f":"SUM(Table_2[[#This Row],[Column20]],Table_2[[#This Row],[Column19]],Table_2[[#This Row],[Column18]])","v":0},"HEALTH & PHY. EDU.",{"$f":"(M44/Instructions!$C$23)*100","v":0},{"$f":"(P44/Instructions!$C$24)*100","v":0},{"$f":"(S44/Instructions!$C$25)*100","v":0},{"$f":"(V44/Instructions!$C$26)*100","v":0},{"$f":"(Y44/Instructions!$C$27)*100","v":0},{"$f":"(AB44/Instructions!$C$28)*100","v":0},{"$f":"(AF44/Instructions!$C$29)*100","v":0},{"$f":"(AJ44/Instructions!$C$30)*100","v":0},{"$f":"(AN44/Instructions!$C$31)*100","v":0},0,{"$f":"(AS44/Instructions!$C$33)*100","v":{"$error":"#VALUE!"}},"----","E","E","E","E","E","E","E","E","E","E","--","E",null,null,null,null,{"$f":"Table_2[[#This Row],[Column51]]&Table_2[[#This Row],[Column52]]&BU46","v":""}]
[43,null,null,null,null,null,null,null,null,null,null,null,0,null,null,0,null,null,0,null,null,0,null,null,0,null,null,0,null,null,null,0,null,null,null,{"$f":"IF(AG45<Instructions!D74,AG45,SUM(AG45:AI45))","v":0},null,null,null,{"$f":"IF(AK45<Instructions!D73,AK45,SUM(AK45:AM45))","v":0},null,null,null,{"$f":"IF(AO45<Instructions!D72,AO45,SUM(AO45:AQ45))","v":0},"--",0,{"$f":"SUM(Table_2[[#This Row],[Column20]],Table_2[[#This Row],[Column19]],Table_2[[#This Row],[Column18]])","v":0},"HEALTH & PHY. EDU.",{"$f":"(M45/Instructions!$C$23)*100","v":0},{"$f":"(P45/Instructions!$C$24)*100","v":0},{"$f":"(S45/Instructions!$C$25)*100","v":0},{"$f":"(V45/Instructions!$C$26)*100","v":0},{"$f":"(Y45/Instructions!$C$27)*100","v":0},{"$f":"(AB45/Instructions!$C$28)*100","v":0},{"$f":"(AF45/Instructions!$C$29)*100","v":0},{"$f":"(AJ45/Instructions!$C$30)*100","v":0},{"$f":"(AN45/Instructions!$C$31)*100","v":0},0,{"$f":"(AS45/Instructions!$C$33)*100","v":{"$error":"#VALUE!"}},"----","E","E","E","E","E","E","E","E","E","E","--","E",null,null,null,null,{"$f":"Table_2[[#This Row],[Column51]]&Table_2[[#This Row],[Column52]]&BU47","v":""}]
[44,null,null,null,null,null,null,null,null,null,null,null,0,null,null,0,null,null,0,null,null,0,null,null,0,null,null,0,null,null,null,0,null,null,null,{"$f":"IF(AG46<Instructions!D75,AG46,SUM(AG46:AI46))","v":0},null,null,null,{"$f":"IF(AK46<Instructions!D74,AK46,SUM(AK46:AM46))","v":0},null,null,null,{"$f":"IF(AO46<Instructions!D73,AO46,SUM(AO46:AQ46))","v":0},"--",0,{"$f":"SUM(Table_2[[#This Row],[Column20]],Table_2[[#This Row],[Column19]],Table_2[[#This Row],[Column18]])","v":0},"HEALTH & PHY. EDU.",{"$f":"(M46/Instructions!$C$23)*100","v":0},{"$f":"(P46/Instructions!$C$24)*100","v":0},{"$f":"(S46/Instructions!$C$25)*100","v":0},{"$f":"(V46/Instructions!$C$26)*100","v":0},{"$f":"(Y46/Instructions!$C$27)*100","v":0},{"$f":"(AB46/Instructions!$C$28)*100","v":0},{"$f":"(AF46/Instructions!$C$29)*100","v":0},{"$f":"(AJ46/Instructions!$C$30)*100","v":0},{"$f":"(AN46/Instructions!$C$31)*100","v":0},0,{"$f":"(AS46/Instructions!$C$33)*100","v":{"$error":"#VALUE!"}},"----","E","E","E","E","E","E","E","E","E","E","--","E",null,null,null,null,{"$f":"Table_2[[#This Row],[Column51]]&Table_2[[#This Row],[Column52]]&BU48","v":""}]
[45,null,null,null,null,null,null,null,null,null,null,null,0,null,null,0,null,null,0,null,null,0,null,null,0,null,null,0,null,null,null,0,null,null,null,{"$f":"IF(AG47<Instructions!D76,AG47,SUM(AG47:AI47))","v":0},null,null,null,{"$f":"IF(AK47<Instructions!D75,AK47,SUM(AK47:AM47))","v":0},null,null,null,{"$f":"IF(AO47<Instructions!D74,AO47,SUM(AO47:AQ47))","v":0},"--",0,{"$f":"SUM(Table_2[[#This Row],[Column20]],Table_2[[#This Row],[Column19]],Table_2[[#This Row],[Column18]])","v":0},"HEALTH & PHY. EDU.",{"$f":"(M47/Instructions!$C$23)*100","v":0},{"$f":"(P47/Instructions!$C$24)*100","v":0},{"$f":"(S47/Instructions!$C$25)*100","v":0},{"$f":"(V47/Instructions!$C$26)*100","v":0},{"$f":"(Y47/Instructions!$C$27)*100","v":0},{"$f":"(AB47/Instructions!$C$28)*100","v":0},{"$f":"(AF47/Instructions!$C$29)*100","v":0},{"$f":"(AJ47/Instructions!$C$30)*100","v":0},{"$f":"(AN47/Instructions!$C$31)*100","v":0},0,{"$f":"(AS47/Instructions!$C$33)*100","v":{"$error":"#VALUE!"}},"----","E","E","E","E","E","E","E","E","E","E","--","E",null,null,null,null,{"$f":"Table_2[[#This Row],[Column51]]&Table_2[[#This Row],[Column52]]&BU49","v":""}]
[46,null,null,null,null,null,null,null,null,null,null,null,0,null,null,0,null,null,0,null,null,0,null,null,0,null,null,0,null,null,null,0,null,null,null,{"$f":"IF(AG48<Instructions!D77,AG48,SUM(AG48:AI48))","v":0},null,null,null,{"$f":"IF(AK48<Instructions!D76,AK48,SUM(AK48:AM48))","v":0},null,null,null,{"$f":"IF(AO48<Instructions!D75,AO48,SUM(AO48:AQ48))","v":0},"--",0,{"$f":"SUM(Table_2[[#This Row],[Column20]],Table_2[[#This Row],[Column19]],Table_2[[#This Row],[Column18]])","v":0},"HEALTH & PHY. EDU.",{"$f":"(M48/Instructions!$C$23)*100","v":0},{"$f":"(P48/Instructions!$C$24)*100","v":0},{"$f":"(S48/Instructions!$C$25)*100","v":0},{"$f":"(V48/Instructions!$C$26)*100","v":0},{"$f":"(Y48/Instructions!$C$27)*100","v":0},{"$f":"(AB48/Instructions!$C$28)*100","v":0},{"$f":"(AF48/Instructions!$C$29)*100","v":0},{"$f":"(AJ48/Instructions!$C$30)*100","v":0},{"$f":"(AN48/Instructions!$C$31)*100","v":0},0,{"$f":"(AS48/Instructions!$C$33)*100","v":{"$error":"#VALUE!"}},"----","E","E","E","E","E","E","E","E","E","E","--","E",null,null,null,null,{"$f":"Table_2[[#This Row],[Column51]]&Table_2[[#This Row],[Column52]]&BU50","v":""}]
[47,null,null,null,null,null,null,null,null,null,null,null,0,null,null,0,null,null,0,null,null,0,null,null,0,null,null,0,null,null,null,0,null,null,null,{"$f":"IF(AG49<Instructions!D78,AG49,SUM(AG49:AI49))","v":0},null,null,null,{"$f":"IF(AK49<Instructions!D77,AK49,SUM(AK49:AM49))","v":0},null,null,null,{"$f":"IF(AO49<Instructions!D76,AO49,SUM(AO49:AQ49))","v":0},"--",0,{"$f":"SUM(Table_2[[#This Row],[Column20]],Table_2[[#This Row],[Column19]],Table_2[[#This Row],[Column18]])","v":0},"HEALTH & PHY. EDU.",{"$f":"(M49/Instructions!$C$23)*100","v":0},{"$f":"(P49/Instructions!$C$24)*100","v":0},{"$f":"(S49/Instructions!$C$25)*100","v":0},{"$f":"(V49/Instructions!$C$26)*100","v":0},{"$f":"(Y49/Instructions!$C$27)*100","v":0},{"$f":"(AB49/Instructions!$C$28)*100","v":0},{"$f":"(AF49/Instructions!$C$29)*100","v":0},{"$f":"(AJ49/Instructions!$C$30)*100","v":0},{"$f":"(AN49/Instructions!$C$31)*100","v":0},0,{"$f":"(AS49/Instructions!$C$33)*100","v":{"$error":"#VALUE!"}},"----","E","E","E","E","E","E","E","E","E","E","--","E",null,null,null,null,{"$f":"Table_2[[#This Row],[Column51]]&Table_2[[#This Row],[Column52]]&BU51","v":""}]
[48,null,null,null,null,null,null,null,null,null,null,null,0,null,null,0,null,null,0,null,null,0,null,null,0,null,null,0,null,null,null,0,null,null,null,{"$f":"IF(AG50<Instructions!D79,AG50,SUM(AG50:AI50))","v":0},null,null,null,{"$f":"IF(AK50<Instructions!D78,AK50,SUM(AK50:AM50))","v":0},null,null,null,{"$f":"IF(AO50<Instructions!D77,AO50,SUM(AO50:AQ50))","v":0},"--",0,{"$f":"SUM(Table_2[[#This Row],[Column20]],Table_2[[#This Row],[Column19]],Table_2[[#This Row],[Column18]])","v":0},"HEALTH & PHY. EDU.",{"$f":"(M50/Instructions!$C$23)*100","v":0},{"$f":"(P50/Instructions!$C$24)*100","v":0},{"$f":"(S50/Instructions!$C$25)*100","v":0},{"$f":"(V50/Instructions!$C$26)*100","v":0},{"$f":"(Y50/Instructions!$C$27)*100","v":0},{"$f":"(AB50/Instructions!$C$28)*100","v":0},{"$f":"(AF50/Instructions!$C$29)*100","v":0},{"$f":"(AJ50/Instructions!$C$30)*100","v":0},{"$f":"(AN50/Instructions!$C$31)*100","v":0},0,{"$f":"(AS50/Instructions!$C$33)*100","v":{"$error":"#VALUE!"}},"----","E","E","E","E","E","E","E","E","E","E","--","E",null,null,null,null,{"$f":"Table_2[[#This Row],[Column51]]&Table_2[[#This Row],[Column52]]&BU52","v":""}]
[49,null,null,null,null,null,null,null,null,null,null,null,0,null,null,0,null,null,0,null,null,0,null,null,0,null,null,0,null,null,null,0,null,null,null,{"$f":"IF(AG51<Instructions!D80,AG51,SUM(AG51:AI51))","v":0},null,null,null,{"$f":"IF(AK51<Instructions!D79,AK51,SUM(AK51:AM51))","v":0},null,null,null,{"$f":"IF(AO51<Instructions!D78,AO51,SUM(AO51:AQ51))","v":0},"--",0,{"$f":"SUM(Table_2[[#This Row],[Column20]],Table_2[[#This Row],[Column19]],Table_2[[#This Row],[Column18]])","v":0},"HEALTH & PHY. EDU.",{"$f":"(M51/Instructions!$C$23)*100","v":0},{"$f":"(P51/Instructions!$C$24)*100","v":0},{"$f":"(S51/Instructions!$C$25)*100","v":0},{"$f":"(V51/Instructions!$C$26)*100","v":0},{"$f":"(Y51/Instructions!$C$27)*100","v":0},{"$f":"(AB51/Instructions!$C$28)*100","v":0},{"$f":"(AF51/Instructions!$C$29)*100","v":0},{"$f":"(AJ51/Instructions!$C$30)*100","v":0},{"$f":"(AN51/Instructions!$C$31)*100","v":0},0,{"$f":"(AS51/Instructions!$C$33)*100","v":{"$error":"#VALUE!"}},"----","E","E",{"$f":"IFERROR(IF(AY51>90,\"A+\",IF(AY51>80,\"A\",IF(AY51>70,\"B+\",IF(AY51>60,\"B\",IF(AY51>50,\"C+\",IF(AY51>40,\"C\",IF(AY51>=33,\"D\",\"E\"))))))),\"Abs\")","v":"E"},"E","E","E","E","E","E","E","--","E",null,null,null,null,{"$f":"Table_2[[#This Row],[Column51]]&Table_2[[#This Row],[Column52]]&BU53","v":""}]
[50,null,null,null,null,null,null,null,null,null,null,null,0,null,null,0,null,null,0,null,null,0,null,null,0,null,null,0,null,null,null,0,null,null,null,{"$f":"IF(AG52<Instructions!D81,AG52,SUM(AG52:AI52))","v":0},null,null,null,{"$f":"IF(AK52<Instructions!D80,AK52,SUM(AK52:AM52))","v":0},null,null,null,{"$f":"IF(AO52<Instructions!D79,AO52,SUM(AO52:AQ52))","v":0},"--",0,{"$f":"SUM(Table_2[[#This Row],[Column20]],Table_2[[#This Row],[Column19]],Table_2[[#This Row],[Column18]])","v":0},"HEALTH & PHY. EDU.",{"$f":"(M52/Instructions!$C$23)*100","v":0},{"$f":"(P52/Instructions!$C$24)*100","v":0},{"$f":"(S52/Instructions!$C$25)*100","v":0},{"$f":"(V52/Instructions!$C$26)*100","v":0},{"$f":"(Y52/Instructions!$C$27)*100","v":0},{"$f":"(AB52/Instructions!$C$28)*100","v":0},{"$f":"(AF52/Instructions!$C$29)*100","v":0},{"$f":"(AJ52/Instructions!$C$30)*100","v":0},{"$f":"(AN52/Instructions!$C$31)*100","v":0},0,{"$f":"(AS52/Instructions!$C$33)*100","v":{"$error":"#VALUE!"}},"----","E","E","E","E","E","E","E","E","E","E","--","E",null,null,null,null,{"$f":"Table_2[[#This Row],[Column51]]&Table_2[[#This Row],[Column52]]&BU54","v":""}]
[51,null,null,null,null,null,null,null,null,null,null,null,0,null,null,0,null,null,0,null,null,0,null,null,0,null,null,0,null,null,null,0,null,null,null,{"$f":"IF(AG53<Instructions!D82,AG53,SUM(AG53:AI53))","v":0},null,null,null,{"$f":"IF(AK53<Instructions!D81,AK53,SUM(AK53:AM53))","v":0},null,null,null,{"$f":"IF(AO53<Instructions!D80,AO53,SUM(AO53:AQ53))","v":0},"--",0,{"$f":"SUM(Table_2[[#This Row],[Column20]],Table_2[[#This Row],[Column19]],Table_2[[#This Row],[Column18]])","v":0},"HEALTH & PHY. EDU.",{"$f":"(M53/Instructions!$C$23)*100","v":0},{"$f":"(P53/Instructions!$C$24)*100","v":0},{"$f":"(S53/Instructions!$C$25)*100","v":0},{"$f":"(V53/Instructions!$C$26)*100","v":0},{"$f":"(Y53/Instructions!$C$27)*100","v":0},{"$f":"(AB53/Instructions!$C$28)*100","v":0},{"$f":"(AF53/Instructions!$C$29)*100","v":0},{"$f":"(AJ53/Instructions!$C$30)*100","v":0},{"$f":"(AN53/Instructions!$C$31)*100","v":0},0,{"$f":"(AS53/Instructions!$C$33)*100","v":{"$error":"#VALUE!"}},"----","E","E",{"$f":"IFERROR(IF(AY53>90,\"A+\",IF(AY53>80,\"A\",IF(AY53>70,\"B+\",IF(AY53>60,\"B\",IF(AY53>50,\"C+\",IF(AY53>40,\"C\",IF(AY53>=33,\"D\",\"E\"))))))),\"Abs\")","v":"E"},{"$f":"IFERROR(IF(AZ53>90,\"A+\",IF(AZ53>80,\"A\",IF(AZ53>70,\"B+\",IF(AZ53>60,\"B\",IF(AZ53>50,\"C+\",IF(AZ53>40,\"C\",IF(AZ53>=33,\"D\",\"E\"))))))),\"Abs\")","v":"E"},{"$f":"IFERROR(IF(BA53>90,\"A+\",IF(BA53>80,\"A\",IF(BA53>70,\"B+\",IF(BA53>60,\"B\",IF(BA53>50,\"C+\",IF(BA53>40,\"C\",IF(BA53>=33,\"D\",\"E\"))))))),\"Abs\")","v":"E"},{"$f":"IFERROR(IF(BB53>90,\"A+\",IF(BB53>80,\"A\",IF(BB53>70,\"B+\",IF(BB53>60,\"B\",IF(BB53>50,\"C+\",IF(BB53>40,\"C\",IF(BB53>=33,\"D\",\"E\"))))))),\"Abs\")","v":"E"},{"$f":"IFERROR(IF(BC53>90,\"A+\",IF(BC53>80,\"A\",IF(BC53>70,\"B+\",IF(BC53>60,\"B\",IF(BC53>50,\"C+\",IF(BC53>40,\"C\",IF(BC53>=33,\"D\",\"E\"))))))),\"Abs\")","v":"E"},{"$f":"IFERROR(IF(BD53>90,\"A+\",IF(BD53>80,\"A\",IF(BD53>70,\"B+\",IF(BD53>60,\"B\",IF(BD53>50,\"C+\",IF(BD53>40,\"C\",IF(BD53>=33,\"D\",\"E\"))))))),\"Abs\")","v":"E"},{"$f":"IFERROR(IF(BE53>90,\"A+\",IF(BE53>80,\"A\",IF(BE53>70,\"B+\",IF(BE53>60,\"B\",IF(BE53>50,\"C+\",IF(BE53>40,\"C\",IF(BE53>=33,\"D\",\"E\"))))))),\"Abs\")","v":"E"},{"$f":"IFERROR(IF(BF53>90,\"A+\",IF(BF53>80,\"A\",IF(BF53>70,\"B+\",IF(BF53>60,\"B\",IF(BF53>50,\"C+\",IF(BF53>40,\"C\",IF(BF53>=33,\"D\",\"E\"))))))),\"Abs\")","v":"E"},"--","E",null,null,null,null,{"$f":"Table_2[[#This Row],[Column51]]&Table_2[[#This Row],[Column52]]&BU55","v":""}]
[52,null,null,null,null,null,null,null,null,null,null,null,0,null,null,0,null,null,0,null,null,0,null,null,0,null,null,0,null,null,null,0,null,null,null,{"$f":"IF(AG54<Instructions!D83,AG54,SUM(AG54:AI54))","v":0},null,null,null,{"$f":"IF(AK54<Instructions!D82,AK54,SUM(AK54:AM54))","v":0},null,null,null,{"$f":"IF(AO54<Instructions!D81,AO54,SUM(AO54:AQ54))","v":0},"--",0,{"$f":"SUM(Table_2[[#This Row],[Column20]],Table_2[[#This Row],[Column19]],Table_2[[#This Row],[Column18]])","v":0},"HEALTH & PHY. EDU.",{"$f":"(M54/Instructions!$C$23)*100","v":0},{"$f":"(P54/Instructions!$C$24)*100","v":0},{"$f":"(S54/Instructions!$C$25)*100","v":0},{"$f":"(V54/Instructions!$C$26)*100","v":0},{"$f":"(Y54/Instructions!$C$27)*100","v":0},{"$f":"(AB54/Instructions!$C$28)*100","v":0},{"$f":"(AF54/Instructions!$C$29)*100","v":0},{"$f":"(AJ54/Instructions!$C$30)*100","v":0},{"$f":"(AN54/Instructions!$C$31)*100","v":0},0,{"$f":"(AS54/Instructions!$C$33)*100","v":{"$error":"#VALUE!"}},"----","E","E","E","E","E","E","E","E","E","E","--","E",null,null,null,null,{"$f":"Table_2[[#This Row],[Column51]]&Table_2[[#This Row],[Column52]]&BU56","v":""}]
[53,null,null,null,null,null,null,null,null,null,null,null,0,null,null,0,null,null,0,null,null,0,null,null,0,null,null,0,null,null,null,0,null,null,null,{"$f":"IF(AG55<Instructions!D84,AG55,SUM(AG55:AI55))","v":0},null,null,null,{"$f":"IF(AK55<Instructions!D83,AK55,SUM(AK55:AM55))","v":0},null,null,null,{"$f":"IF(AO55<Instructions!D82,AO55,SUM(AO55:AQ55))","v":0},"--",0,{"$f":"SUM(Table_2[[#This Row],[Column20]],Table_2[[#This Row],[Column19]],Table_2[[#This Row],[Column18]])","v":0},"HEALTH & PHY. EDU.",{"$f":"(M55/Instructions!$C$23)*100","v":0},{"$f":"(P55/Instructions!$C$24)*100","v":0},{"$f":"(S55/Instructions!$C$25)*100","v":0},{"$f":"(V55/Instructions!$C$26)*100","v":0},{"$f":"(Y55/Instructions!$C$27)*100","v":0},{"$f":"(AB55/Instructions!$C$28)*100","v":0},{"$f":"(AF55/Instructions!$C$29)*100","v":0},{"$f":"(AJ55/Instructions!$C$30)*100","v":0},{"$f":"(AN55/Instructions!$C$31)*100","v":0},0,{"$f":"(AS55/Instructions!$C$33)*100","v":{"$error":"#VALUE!"}},"----","E","E","E","E","E","E","E","E","E","E","--","E",null,null,null,null,{"$f":"Table_2[[#This Row],[Column51]]&Table_2[[#This Row],[Column52]]&BU57","v":""}]
[54,null,null,null,null,null,null,null,null,null,null,null,0,null,null,0,null,null,0,null,null,0,null,null,0,null,null,0,null,null,null,0,null,null,null,{"$f":"IF(AG56<Instructions!D85,AG56,SUM(AG56:AI56))","v":0},null,null,null,{"$f":"IF(AK56<Instructions!D84,AK56,SUM(AK56:AM56))","v":0},null,null,null,{"$f":"IF(AO56<Instructions!D83,AO56,SUM(AO56:AQ56))","v":0},"--",0,{"$f":"SUM(Table_2[[#This Row],[Column20]],Table_2[[#This Row],[Column19]],Table_2[[#This Row],[Column18]])","v":0},"HEALTH & PHY. EDU.",{"$f":"(M56/Instructions!$C$23)*100","v":0},{"$f":"(P56/Instructions!$C$24)*100","v":0},{"$f":"(S56/Instructions!$C$25)*100","v":0},{"$f":"(V56/Instructions!$C$26)*100","v":0},{"$f":"(Y56/Instructions!$C$27)*100","v":0},{"$f":"(AB56/Instructions!$C$28)*100","v":0},{"$f":"(AF56/Instructions!$C$29)*100","v":0},{"$f":"(AJ56/Instructions!$C$30)*100","v":0},{"$f":"(AN56/Instructions!$C$31)*100","v":0},0,{"$f":"(AS56/Instructions!$C$33)*100","v":{"$error":"#VALUE!"}},"----","E","E","E","E","E","E","E","E","E","E","--","E",null,null,null,null,{"$f":"Table_2[[#This Row],[Column51]]&Table_2[[#This Row],[Column52]]&BU58","v":""}]
[55,null,null,null,null,null,null,null,null,null,null,null,0,null,null,0,null,null,0,null,null,0,null,null,0,null,null,0,null,null,null,0,null,null,null,{"$f":"IF(AG57<Instructions!D86,AG57,SUM(AG57:AI57))","v":0},null,null,null,{"$f":"IF(AK57<Instructions!D85,AK57,SUM(AK57:AM57))","v":0},null,null,null,{"$f":"IF(AO57<Instructions!D84,AO57,SUM(AO57:AQ57))","v":0},"--",0,{"$f":"SUM(Table_2[[#This Row],[Column20]],Table_2[[#This Row],[Column19]],Table_2[[#This Row],[Column18]])","v":0},"HEALTH & PHY. EDU.",{"$f":"(M57/Instructions!$C$23)*100","v":0},{"$f":"(P57/Instructions!$C$24)*100","v":0},{"$f":"(S57/Instructions!$C$25)*100","v":0},{"$f":"(V57/Instructions!$C$26)*100","v":0},{"$f":"(Y57/Instructions!$C$27)*100","v":0},{"$f":"(AB57/Instructions!$C$28)*100","v":0},{"$f":"(AF57/Instructions!$C$29)*100","v":0},{"$f":"(AJ57/Instructions!$C$30)*100","v":0},{"$f":"(AN57/Instructions!$C$31)*100","v":0},0,{"$f":"(AS57/Instructions!$C$33)*100","v":{"$error":"#VALUE!"}},"----","E","E","E","E","E","E","E","E","E","E","--","E",null,null,null,null,{"$f":"Table_2[[#This Row],[Column51]]&Table_2[[#This Row],[Column52]]&BU59","v":""}]
[56,null,null,null,null,null,null,null,null,null,null,null,0,null,null,0,null,null,0,null,null,0,null,null,0,null,null,0,null,null,null,0,null,null,null,{"$f":"IF(AG58<Instructions!D87,AG58,SUM(AG58:AI58))","v":0},null,null,null,{"$f":"IF(AK58<Instructions!D86,AK58,SUM(AK58:AM58))","v":0},null,null,null,{"$f":"IF(AO58<Instructions!D85,AO58,SUM(AO58:AQ58))","v":0},"--",0,{"$f":"SUM(Table_2[[#This Row],[Column20]],Table_2[[#This Row],[Column19]],Table_2[[#This Row],[Column18]])","v":0},"HEALTH & PHY. EDU.",{"$f":"(M58/Instructions!$C$23)*100","v":0},{"$f":"(P58/Instructions!$C$24)*100","v":0},{"$f":"(S58/Instructions!$C$25)*100","v":0},{"$f":"(V58/Instructions!$C$26)*100","v":0},{"$f":"(Y58/Instructions!$C$27)*100","v":0},{"$f":"(AB58/Instructions!$C$28)*100","v":0},{"$f":"(AF58/Instructions!$C$29)*100","v":0},{"$f":"(AJ58/Instructions!$C$30)*100","v":0},{"$f":"(AN58/Instructions!$C$31)*100","v":0},0,{"$f":"(AS58/Instructions!$C$33)*100","v":{"$error":"#VALUE!"}},"----","E","E","E","E","E","E","E","E","E","E","--","E",null,null,null,null,{"$f":"Table_2[[#This Row],[Column51]]&Table_2[[#This Row],[Column52]]&BU60","v":""}]
[57,null,null,null,null,null,null,null,null,null,null,null,0,null,null,0,null,null,0,null,null,0,null,null,0,null,null,0,null,null,null,0,null,null,null,{"$f":"IF(AG59<Instructions!D88,AG59,SUM(AG59:AI59))","v":0},null,null,null,{"$f":"IF(AK59<Instructions!D87,AK59,SUM(AK59:AM59))","v":0},null,null,null,{"$f":"IF(AO59<Instructions!D86,AO59,SUM(AO59:AQ59))","v":0},"--",0,{"$f":"SUM(Table_2[[#This Row],[Column20]],Table_2[[#This Row],[Column19]],Table_2[[#This Row],[Column18]])","v":0},"HEALTH & PHY. EDU.",{"$f":"(M59/Instructions!$C$23)*100","v":0},{"$f":"(P59/Instructions!$C$24)*100","v":0},{"$f":"(S59/Instructions!$C$25)*100","v":0},{"$f":"(V59/Instructions!$C$26)*100","v":0},{"$f":"(Y59/Instructions!$C$27)*100","v":0},{"$f":"(AB59/Instructions!$C$28)*100","v":0},{"$f":"(AF59/Instructions!$C$29)*100","v":0},{"$f":"(AJ59/Instructions!$C$30)*100","v":0},{"$f":"(AN59/Instructions!$C$31)*100","v":0},0,{"$f":"(AS59/Instructions!$C$33)*100","v":{"$error":"#VALUE!"}},"----","E","E","E","E","E","E","E","E","E","E","--","E",null,null,null,null,{"$f":"Table_2[[#This Row],[Column51]]&Table_2[[#This Row],[Column52]]&BU61","v":""}]
[58,null,null,null,null,null,null,null,null,null,null,null,0,null,null,0,null,null,0,null,null,0,null,null,0,null,null,0,null,null,null,0,null,null,null,{"$f":"IF(AG60<Instructions!D89,AG60,SUM(AG60:AI60))","v":0},null,null,null,{"$f":"IF(AK60<Instructions!D88,AK60,SUM(AK60:AM60))","v":0},null,null,null,{"$f":"IF(AO60<Instructions!D87,AO60,SUM(AO60:AQ60))","v":0},"--",0,{"$f":"SUM(Table_2[[#This Row],[Column20]],Table_2[[#This Row],[Column19]],Table_2[[#This Row],[Column18]])","v":0},"HEALTH & PHY. EDU.",{"$f":"(M60/Instructions!$C$23)*100","v":0},{"$f":"(P60/Instructions!$C$24)*100","v":0},{"$f":"(S60/Instructions!$C$25)*100","v":0},{"$f":"(V60/Instructions!$C$26)*100","v":0},{"$f":"(Y60/Instructions!$C$27)*100","v":0},{"$f":"(AB60/Instructions!$C$28)*100","v":0},{"$f":"(AF60/Instructions!$C$29)*100","v":0},{"$f":"(AJ60/Instructions!$C$30)*100","v":0},{"$f":"(AN60/Instructions!$C$31)*100","v":0},0,{"$f":"(AS60/Instructions!$C$33)*100","v":{"$error":"#VALUE!"}},"----","E","E","E","E","E","E","E","E","E","E","--","E",null,null,null,null,{"$f":"Table_2[[#This Row],[Column51]]&Table_2[[#This Row],[Column52]]&BU62","v":""}]
[59,null,null,null,null,null,null,null,null,null,null,null,0,null,null,0,null,null,0,null,null,0,null,null,0,null,null,0,null,null,null,0,null,null,null,{"$f":"IF(AG61<Instructions!D90,AG61,SUM(AG61:AI61))","v":0},null,null,null,{"$f":"IF(AK61<Instructions!D89,AK61,SUM(AK61:AM61))","v":0},null,null,null,{"$f":"IF(AO61<Instructions!D88,AO61,SUM(AO61:AQ61))","v":0},"--",0,{"$f":"SUM(Table_2[[#This Row],[Column20]],Table_2[[#This Row],[Column19]],Table_2[[#This Row],[Column18]])","v":0},"HEALTH & PHY. EDU.",{"$f":"(M61/Instructions!$C$23)*100","v":0},{"$f":"(P61/Instructions!$C$24)*100","v":0},{"$f":"(S61/Instructions!$C$25)*100","v":0},{"$f":"(V61/Instructions!$C$26)*100","v":0},{"$f":"(Y61/Instructions!$C$27)*100","v":0},{"$f":"(AB61/Instructions!$C$28)*100","v":0},{"$f":"(AF61/Instructions!$C$29)*100","v":0},{"$f":"(AJ61/Instructions!$C$30)*100","v":0},{"$f":"(AN61/Instructions!$C$31)*100","v":0},0,{"$f":"(AS61/Instructions!$C$33)*100","v":{"$error":"#VALUE!"}},"----","E","E","E","E","E","E","E","E","E","E","--","E",null,null,null,null,{"$f":"Table_2[[#This Row],[Column51]]&Table_2[[#This Row],[Column52]]&BU63","v":""}]
[60,null,null,null,null,null,null,null,null,null,null,null,0,null,null,0,null,null,0,null,null,0,null,null,0,null,null,0,null,null,null,0,null,null,null,{"$f":"IF(AG62<Instructions!D91,AG62,SUM(AG62:AI62))","v":0},null,null,null,{"$f":"IF(AK62<Instructions!D90,AK62,SUM(AK62:AM62))","v":0},null,null,null,{"$f":"IF(AO62<Instructions!D89,AO62,SUM(AO62:AQ62))","v":0},"--",0,{"$f":"SUM(Table_2[[#This Row],[Column20]],Table_2[[#This Row],[Column19]],Table_2[[#This Row],[Column18]])","v":0},"HEALTH & PHY. EDU.",{"$f":"(M62/Instructions!$C$23)*100","v":0},{"$f":"(P62/Instructions!$C$24)*100","v":0},{"$f":"(S62/Instructions!$C$25)*100","v":0},{"$f":"(V62/Instructions!$C$26)*100","v":0},{"$f":"(Y62/Instructions!$C$27)*100","v":0},{"$f":"(AB62/Instructions!$C$28)*100","v":0},{"$f":"(AF62/Instructions!$C$29)*100","v":0},{"$f":"(AJ62/Instructions!$C$30)*100","v":0},{"$f":"(AN62/Instructions!$C$31)*100","v":0},0,{"$f":"(AS62/Instructions!$C$33)*100","v":{"$error":"#VALUE!"}},"----","E","E","E","E","E","E","E","E","E","E","--","E",null,null,null,null,{"$f":"Table_2[[#This Row],[Column51]]&Table_2[[#This Row],[Column52]]&BU64","v":""}]
[61,null,null,null,null,null,null,null,null,null,null,null,0,null,null,0,null,null,0,null,null,0,null,null,0,null,null,0,null,null,null,0,null,null,null,{"$f":"IF(AG63<Instructions!D92,AG63,SUM(AG63:AI63))","v":0},null,null,null,{"$f":"IF(AK63<Instructions!D91,AK63,SUM(AK63:AM63))","v":0},null,null,null,{"$f":"IF(AO63<Instructions!D90,AO63,SUM(AO63:AQ63))","v":0},"--",0,{"$f":"SUM(Table_2[[#This Row],[Column20]],Table_2[[#This Row],[Column19]],Table_2[[#This Row],[Column18]])","v":0},"HEALTH & PHY. EDU.",{"$f":"(M63/Instructions!$C$23)*100","v":0},{"$f":"(P63/Instructions!$C$24)*100","v":0},{"$f":"(S63/Instructions!$C$25)*100","v":0},{"$f":"(V63/Instructions!$C$26)*100","v":0},{"$f":"(Y63/Instructions!$C$27)*100","v":0},{"$f":"(AB63/Instructions!$C$28)*100","v":0},{"$f":"(AF63/Instructions!$C$29)*100","v":0},{"$f":"(AJ63/Instructions!$C$30)*100","v":0},{"$f":"(AN63/Instructions!$C$31)*100","v":0},0,{"$f":"(AS63/Instructions!$C$33)*100","v":{"$error":"#VALUE!"}},"----","E","E","E","E","E","E","E","E","E","E","--","E",null,null,null,null,{"$f":"Table_2[[#This Row],[Column51]]&Table_2[[#This Row],[Column52]]&BU65","v":""}]
[62,null,null,null,null,null,null,null,null,null,null,null,0,null,null,0,null,null,0,null,null,0,null,null,0,null,null,0,null,null,null,0,null,null,null,{"$f":"IF(AG64<Instructions!D93,AG64,SUM(AG64:AI64))","v":0},null,null,null,{"$f":"IF(AK64<Instructions!D92,AK64,SUM(AK64:AM64))","v":0},null,null,null,{"$f":"IF(AO64<Instructions!D91,AO64,SUM(AO64:AQ64))","v":0},"--",0,{"$f":"SUM(Table_2[[#This Row],[Column20]],Table_2[[#This Row],[Column19]],Table_2[[#This Row],[Column18]])","v":0},"HEALTH & PHY. EDU.",{"$f":"(M64/Instructions!$C$23)*100","v":0},{"$f":"(P64/Instructions!$C$24)*100","v":0},{"$f":"(S64/Instructions!$C$25)*100","v":0},{"$f":"(V64/Instructions!$C$26)*100","v":0},{"$f":"(Y64/Instructions!$C$27)*100","v":0},{"$f":"(AB64/Instructions!$C$28)*100","v":0},{"$f":"(AF64/Instructions!$C$29)*100","v":0},{"$f":"(AJ64/Instructions!$C$30)*100","v":0},{"$f":"(AN64/Instructions!$C$31)*100","v":0},0,{"$f":"(AS64/Instructions!$C$33)*100","v":{"$error":"#VALUE!"}},"----","E","E","E","E","E","E","E","E","E","E","--","E",null,null,null,null,{"$f":"Table_2[[#This Row],[Column51]]&Table_2[[#This Row],[Column52]]&BU66","v":""}]
[63,null,null,null,null,null,null,null,null,null,null,null,0,null,null,0,null,null,0,null,null,0,null,null,0,null,null,0,null,null,null,0,null,null,null,{"$f":"IF(AG65<Instructions!D94,AG65,SUM(AG65:AI65))","v":0},null,null,null,{"$f":"IF(AK65<Instructions!D93,AK65,SUM(AK65:AM65))","v":0},null,null,null,{"$f":"IF(AO65<Instructions!D92,AO65,SUM(AO65:AQ65))","v":0},"--",0,{"$f":"SUM(Table_2[[#This Row],[Column20]],Table_2[[#This Row],[Column19]],Table_2[[#This Row],[Column18]])","v":0},"HEALTH & PHY. EDU.",{"$f":"(M65/Instructions!$C$23)*100","v":0},{"$f":"(P65/Instructions!$C$24)*100","v":0},{"$f":"(S65/Instructions!$C$25)*100","v":0},{"$f":"(V65/Instructions!$C$26)*100","v":0},{"$f":"(Y65/Instructions!$C$27)*100","v":0},{"$f":"(AB65/Instructions!$C$28)*100","v":0},{"$f":"(AF65/Instructions!$C$29)*100","v":0},{"$f":"(AJ65/Instructions!$C$30)*100","v":0},{"$f":"(AN65/Instructions!$C$31)*100","v":0},0,{"$f":"(AS65/Instructions!$C$33)*100","v":{"$error":"#VALUE!"}},"----","E","E","E","E","E","E","E","E","E","E","--","E",null,null,null,null,{"$f":"Table_2[[#This Row],[Column51]]&Table_2[[#This Row],[Column52]]&BU67","v":""}]
[64,null,null,null,null,null,null,null,null,null,null,null,0,null,null,0,null,null,0,null,null,0,null,null,0,null,null,0,null,null,null,0,null,null,null,{"$f":"IF(AG66<Instructions!D95,AG66,SUM(AG66:AI66))","v":0},null,null,null,{"$f":"IF(AK66<Instructions!D94,AK66,SUM(AK66:AM66))","v":0},null,null,null,{"$f":"IF(AO66<Instructions!D93,AO66,SUM(AO66:AQ66))","v":0},"--",0,{"$f":"SUM(Table_2[[#This Row],[Column20]],Table_2[[#This Row],[Column19]],Table_2[[#This Row],[Column18]])","v":0},"HEALTH & PHY. EDU.",{"$f":"(M66/Instructions!$C$23)*100","v":0},{"$f":"(P66/Instructions!$C$24)*100","v":0},{"$f":"(S66/Instructions!$C$25)*100","v":0},{"$f":"(V66/Instructions!$C$26)*100","v":0},{"$f":"(Y66/Instructions!$C$27)*100","v":0},{"$f":"(AB66/Instructions!$C$28)*100","v":0},{"$f":"(AF66/Instructions!$C$29)*100","v":0},{"$f":"(AJ66/Instructions!$C$30)*100","v":0},{"$f":"(AN66/Instructions!$C$31)*100","v":0},0,{"$f":"(AS66/Instructions!$C$33)*100","v":{"$error":"#VALUE!"}},"----","E","E","E","E","E","E","E","E","E","E","--","E",null,null,null,null,{"$f":"Table_2[[#This Row],[Column51]]&Table_2[[#This Row],[Column52]]&BU68","v":""}]
[65,null,null,null,null,null,null,null,null,null,null,null,0,null,null,0,null,null,0,null,null,0,null,null,0,null,null,0,null,null,null,0,null,null,null,{"$f":"IF(AG67<Instructions!D96,AG67,SUM(AG67:AI67))","v":0},null,null,null,{"$f":"IF(AK67<Instructions!D95,AK67,SUM(AK67:AM67))","v":0},null,null,null,{"$f":"IF(AO67<Instructions!D94,AO67,SUM(AO67:AQ67))","v":0},"--",0,{"$f":"SUM(Table_2[[#This Row],[Column20]],Table_2[[#This Row],[Column19]],Table_2[[#This Row],[Column18]])","v":0},"HEALTH & PHY. EDU.",{"$f":"(M67/Instructions!$C$23)*100","v":0},{"$f":"(P67/Instructions!$C$24)*100","v":0},{"$f":"(S67/Instructions!$C$25)*100","v":0},{"$f":"(V67/Instructions!$C$26)*100","v":0},{"$f":"(Y67/Instructions!$C$27)*100","v":0},{"$f":"(AB67/Instructions!$C$28)*100","v":0},{"$f":"(AF67/Instructions!$C$29)*100","v":0},{"$f":"(AJ67/Instructions!$C$30)*100","v":0},{"$f":"(AN67/Instructions!$C$31)*100","v":0},0,{"$f":"(AS67/Instructions!$C$33)*100","v":{"$error":"#VALUE!"}},"----","E","E","E","E","E","E","E","E","E","E","--","E",null,null,null,null,{"$f":"Table_2[[#This Row],[Column51]]&Table_2[[#This Row],[Column52]]&BU69","v":""}]
[66,null,null,null,null,null,null,null,null,null,null,null,{"$f":"IF(K68<33,K68,SUM(K68:L68))","v":0},null,null,{"$f":"IF(N68<20,N68,SUM(N68:O68))","v":0},null,null,{"$f":"IF(Q68<20,Q68,SUM(Q68:R68))","v":0},null,null,{"$f":"IF(T68<20,T68,SUM(T68:U68))","v":0},null,null,{"$f":"IF(W68<20,W68,SUM(W68:X68))","v":0},null,null,{"$f":"IF(Z68<20,Z68,SUM(Z68:AA68))","v":0},null,null,null,{"$f":"IF(AC68<10,AC68,SUM(AC68:AE68))","v":0},null,null,null,{"$f":"IF(AG68<Instructions!D97,AG68,SUM(AG68:AI68))","v":0},null,null,null,{"$f":"IF(AK68<Instructions!D96,AK68,SUM(AK68:AM68))","v":0},null,null,null,{"$f":"IF(AO68<Instructions!D95,AO68,SUM(AO68:AQ68))","v":0},{"$f":"IF(MIN(M68,P68,S68,V68,Y68,AB68)>=33,SUM(M68,P68,S68,V68,Y68,AB68),\"--\")","v":"--"},{"$f":"IF(AS68=\"--\",0,AS68)","v":0},{"$f":"SUM(Table_2[[#This Row],[Column20]],Table_2[[#This Row],[Column19]],Table_2[[#This Row],[Column18]])","v":0},{"$f":"IF(N(AJ68)>0,$AG$1,IF(N(AN68)>0,$AK$1,$AO$1))","v":"HEALTH & PHY. EDU."},{"$f":"(M68/Instructions!$C$23)*100","v":0},{"$f":"(P68/Instructions!$C$24)*100","v":0},{"$f":"(S68/Instructions!$C$25)*100","v":0},{"$f":"(V68/Instructions!$C$26)*100","v":0},{"$f":"(Y68/Instructions!$C$27)*100","v":0},{"$f":"(AB68/Instructions!$C$28)*100","v":0},{"$f":"(AF68/Instructions!$C$29)*100","v":0},{"$f":"(AJ68/Instructions!$C$30)*100","v":0},{"$f":"(AN68/Instructions!$C$31)*100","v":0},{"$f":"(AR68/100)*100","v":0},{"$f":"(AS68/Instructions!$C$33)*100","v":{"$error":"#VALUE!"}},{"$f":"IF(AND(AW68>=33,AX68>=33,AY68>=33,AZ68>=33,BA68>=33,BB68>=33),\"PASS\",\"----\")","v":"----"},"E","E","E","E","E","E","E","E","E","E",{"$f":"IFERROR(IF(BG68>90,\"A+\",IF(BG68>80,\"A\",IF(BG68>70,\"B+\",IF(BG68>60,\"B\",IF(BG68>50,\"C+\",IF(BG68>40,\"C\",IF(BG68>=33,\"D\",\"E\"))))))),\"--\")","v":"--"},{"$f":"IFERROR(IF(BF68>90,\"A+\",IF(BF68>80,\"A\",IF(BF68>70,\"B+\",IF(BF68>60,\"B\",IF(BF68>50,\"C+\",IF(BF68>40,\"C\",IF(BF68>=33,\"D\",\"E\"))))))),\"Abs\")","v":"E"},null,null,null,null,{"$f":"Table_2[[#This Row],[Column51]]&Table_2[[#This Row],[Column52]]&BU70","v":""}]
[67,null,null,null,null,null,null,null,null,null,null,null,0,null,null,0,null,null,0,null,null,0,null,null,0,null,null,0,null,null,null,0,null,null,null,{"$f":"IF(AG69<Instructions!D98,AG69,SUM(AG69:AI69))","v":0},null,null,null,{"$f":"IF(AK69<Instructions!D97,AK69,SUM(AK69:AM69))","v":0},null,null,null,{"$f":"IF(AO69<Instructions!D96,AO69,SUM(AO69:AQ69))","v":0},"--",0,{"$f":"SUM(Table_2[[#This Row],[Column20]],Table_2[[#This Row],[Column19]],Table_2[[#This Row],[Column18]])","v":0},"HEALTH & PHY. EDU.",{"$f":"(M69/Instructions!$C$23)*100","v":0},{"$f":"(P69/Instructions!$C$24)*100","v":0},{"$f":"(S69/Instructions!$C$25)*100","v":0},{"$f":"(V69/Instructions!$C$26)*100","v":0},{"$f":"(Y69/Instructions!$C$27)*100","v":0},{"$f":"(AB69/Instructions!$C$28)*100","v":0},{"$f":"(AF69/Instructions!$C$29)*100","v":0},{"$f":"(AJ69/Instructions!$C$30)*100","v":0},{"$f":"(AN69/Instructions!$C$31)*100","v":0},0,{"$f":"(AS69/Instructions!$C$33)*100","v":{"$error":"#VALUE!"}},"----","E","E","E","E","E","E","E","E","E","E","--","E",null,null,null,null,{"$f":"Table_2[[#This Row],[Column51]]&Table_2[[#This Row],[Column52]]&BU71","v":""}]
[68,null,null,null,null,null,null,null,null,null,null,null,0,null,null,0,null,null,0,null,null,0,null,null,0,null,null,0,null,null,null,0,null,null,null,{"$f":"IF(AG70<Instructions!D99,AG70,SUM(AG70:AI70))","v":0},null,null,null,{"$f":"IF(AK70<Instructions!D98,AK70,SUM(AK70:AM70))","v":0},null,null,null,{"$f":"IF(AO70<Instructions!D97,AO70,SUM(AO70:AQ70))","v":0},"--",0,{"$f":"SUM(Table_2[[#This Row],[Column20]],Table_2[[#This Row],[Column19]],Table_2[[#This Row],[Column18]])","v":0},"HEALTH & PHY. EDU.",{"$f":"(M70/Instructions!$C$23)*100","v":0},{"$f":"(P70/Instructions!$C$24)*100","v":0},{"$f":"(S70/Instructions!$C$25)*100","v":0},{"$f":"(V70/Instructions!$C$26)*100","v":0},{"$f":"(Y70/Instructions!$C$27)*100","v":0},{"$f":"(AB70/Instructions!$C$28)*100","v":0},{"$f":"(AF70/Instructions!$C$29)*100","v":0},{"$f":"(AJ70/Instructions!$C$30)*100","v":0},{"$f":"(AN70/Instructions!$C$31)*100","v":0},0,{"$f":"(AS70/Instructions!$C$33)*100","v":{"$error":"#VALUE!"}},"----","E","E","E","E","E","E","E","E","E","E","--","E",null,null,null,null,{"$f":"Table_2[[#This Row],[Column51]]&Table_2[[#This Row],[Column52]]&BU72","v":""}]
[69,null,null,null,null,null,null,null,null,null,null,null,0,null,null,0,null,null,0,null,null,0,null,null,0,null,null,0,null,null,null,0,null,null,null,{"$f":"IF(AG71<Instructions!D100,AG71,SUM(AG71:AI71))","v":0},null,null,null,{"$f":"IF(AK71<Instructions!D99,AK71,SUM(AK71:AM71))","v":0},null,null,null,{"$f":"IF(AO71<Instructions!D98,AO71,SUM(AO71:AQ71))","v":0},"--",0,{"$f":"SUM(Table_2[[#This Row],[Column20]],Table_2[[#This Row],[Column19]],Table_2[[#This Row],[Column18]])","v":0},"HEALTH & PHY. EDU.",{"$f":"(M71/Instructions!$C$23)*100","v":0},{"$f":"(P71/Instructions!$C$24)*100","v":0},{"$f":"(S71/Instructions!$C$25)*100","v":0},{"$f":"(V71/Instructions!$C$26)*100","v":0},{"$f":"(Y71/Instructions!$C$27)*100","v":0},{"$f":"(AB71/Instructions!$C$28)*100","v":0},{"$f":"(AF71/Instructions!$C$29)*100","v":0},{"$f":"(AJ71/Instructions!$C$30)*100","v":0},{"$f":"(AN71/Instructions!$C$31)*100","v":0},0,{"$f":"(AS71/Instructions!$C$33)*100","v":{"$error":"#VALUE!"}},"----","E","E","E","E","E","E","E","E","E","E","--","E",null,null,null,null,{"$f":"Table_2[[#This Row],[Column51]]&Table_2[[#This Row],[Column52]]&BU73","v":""}]
[70,null,null,null,null,null,null,null,null,null,null,null,0,null,null,0,null,null,0,null,null,0,null,null,0,null,null,0,null,null,null,0,null,null,null,{"$f":"IF(AG72<Instructions!D101,AG72,SUM(AG72:AI72))","v":0},null,null,null,{"$f":"IF(AK72<Instructions!D100,AK72,SUM(AK72:AM72))","v":0},null,null,null,{"$f":"IF(AO72<Instructions!D99,AO72,SUM(AO72:AQ72))","v":0},"--",0,{"$f":"SUM(Table_2[[#This Row],[Column20]],Table_2[[#This Row],[Column19]],Table_2[[#This Row],[Column18]])","v":0},"HEALTH & PHY. EDU.",{"$f":"(M72/Instructions!$C$23)*100","v":0},{"$f":"(P72/Instructions!$C$24)*100","v":0},{"$f":"(S72/Instructions!$C$25)*100","v":0},{"$f":"(V72/Instructions!$C$26)*100","v":0},{"$f":"(Y72/Instructions!$C$27)*100","v":0},{"$f":"(AB72/Instructions!$C$28)*100","v":0},{"$f":"(AF72/Instructions!$C$29)*100","v":0},{"$f":"(AJ72/Instructions!$C$30)*100","v":0},{"$f":"(AN72/Instructions!$C$31)*100","v":0},0,{"$f":"(AS72/Instructions!$C$33)*100","v":{"$error":"#VALUE!"}},"----","E","E","E","E","E","E","E","E","E","E","--","E",null,null,null,null,{"$f":"Table_2[[#This Row],[Column51]]&Table_2[[#This Row],[Column52]]&BU74","v":""}]
[71,null,null,null,null,null,null,null,null,null,null,null,0,null,null,0,null,null,0,null,null,0,null,null,0,null,null,0,null,null,null,0,null,null,null,{"$f":"IF(AG73<Instructions!D102,AG73,SUM(AG73:AI73))","v":0},null,null,null,{"$f":"IF(AK73<Instructions!D101,AK73,SUM(AK73:AM73))","v":0},null,null,null,{"$f":"IF(AO73<Instructions!D100,AO73,SUM(AO73:AQ73))","v":0},"--",0,{"$f":"SUM(Table_2[[#This Row],[Column20]],Table_2[[#This Row],[Column19]],Table_2[[#This Row],[Column18]])","v":0},"HEALTH & PHY. EDU.",{"$f":"(M73/Instructions!$C$23)*100","v":0},{"$f":"(P73/Instructions!$C$24)*100","v":0},{"$f":"(S73/Instructions!$C$25)*100","v":0},{"$f":"(V73/Instructions!$C$26)*100","v":0},{"$f":"(Y73/Instructions!$C$27)*100","v":0},{"$f":"(AB73/Instructions!$C$28)*100","v":0},{"$f":"(AF73/Instructions!$C$29)*100","v":0},{"$f":"(AJ73/Instructions!$C$30)*100","v":0},{"$f":"(AN73/Instructions!$C$31)*100","v":0},0,{"$f":"(AS73/Instructions!$C$33)*100","v":{"$error":"#VALUE!"}},"----","E","E","E","E","E","E","E","E","E","E","--","E",null,null,null,null,{"$f":"Table_2[[#This Row],[Column51]]&Table_2[[#This Row],[Column52]]&BU75","v":""}]
[72,null,null,null,null,null,null,null,null,null,null,null,0,null,null,0,null,null,0,null,null,0,null,null,0,null,null,0,null,null,null,0,null,null,null,{"$f":"IF(AG74<Instructions!D103,AG74,SUM(AG74:AI74))","v":0},null,null,null,{"$f":"IF(AK74<Instructions!D102,AK74,SUM(AK74:AM74))","v":0},null,null,null,{"$f":"IF(AO74<Instructions!D101,AO74,SUM(AO74:AQ74))","v":0},"--",0,{"$f":"SUM(Table_2[[#This Row],[Column20]],Table_2[[#This Row],[Column19]],Table_2[[#This Row],[Column18]])","v":0},"HEALTH & PHY. EDU.",{"$f":"(M74/Instructions!$C$23)*100","v":0},{"$f":"(P74/Instructions!$C$24)*100","v":0},{"$f":"(S74/Instructions!$C$25)*100","v":0},{"$f":"(V74/Instructions!$C$26)*100","v":0},{"$f":"(Y74/Instructions!$C$27)*100","v":0},{"$f":"(AB74/Instructions!$C$28)*100","v":0},{"$f":"(AF74/Instructions!$C$29)*100","v":0},{"$f":"(AJ74/Instructions!$C$30)*100","v":0},{"$f":"(AN74/Instructions!$C$31)*100","v":0},0,{"$f":"(AS74/Instructions!$C$33)*100","v":{"$error":"#VALUE!"}},"----","E","E","E","E","E","E","E","E","E","E","--","E",null,null,null,null,{"$f":"Table_2[[#This Row],[Column51]]&Table_2[[#This Row],[Column52]]&BU76","v":""}]
[73,null,null,null,null,null,null,null,null,null,null,null,0,null,null,0,null,null,0,null,null,0,null,null,0,null,null,0,null,null,null,0,null,null,null,{"$f":"IF(AG75<Instructions!D104,AG75,SUM(AG75:AI75))","v":0},null,null,null,{"$f":"IF(AK75<Instructions!D103,AK75,SUM(AK75:AM75))","v":0},null,null,null,{"$f":"IF(AO75<Instructions!D102,AO75,SUM(AO75:AQ75))","v":0},"--",0,{"$f":"SUM(Table_2[[#This Row],[Column20]],Table_2[[#This Row],[Column19]],Table_2[[#This Row],[Column18]])","v":0},"HEALTH & PHY. EDU.",{"$f":"(M75/Instructions!$C$23)*100","v":0},{"$f":"(P75/Instructions!$C$24)*100","v":0},{"$f":"(S75/Instructions!$C$25)*100","v":0},{"$f":"(V75/Instructions!$C$26)*100","v":0},{"$f":"(Y75/Instructions!$C$27)*100","v":0},{"$f":"(AB75/Instructions!$C$28)*100","v":0},{"$f":"(AF75/Instructions!$C$29)*100","v":0},{"$f":"(AJ75/Instructions!$C$30)*100","v":0},{"$f":"(AN75/Instructions!$C$31)*100","v":0},0,{"$f":"(AS75/Instructions!$C$33)*100","v":{"$error":"#VALUE!"}},"----","E","E","E","E","E","E","E","E","E","E","--","E",null,null,null,null,{"$f":"Table_2[[#This Row],[Column51]]&Table_2[[#This Row],[Column52]]&BU77","v":""}]
[74,null,null,null,null,null,null,null,null,null,null,null,0,null,null,0,null,null,0,null,null,0,null,null,0,null,null,0,null,null,null,0,null,null,null,{"$f":"IF(AG76<Instructions!D105,AG76,SUM(AG76:AI76))","v":0},null,null,null,{"$f":"IF(AK76<Instructions!D104,AK76,SUM(AK76:AM76))","v":0},null,null,null,{"$f":"IF(AO76<Instructions!D103,AO76,SUM(AO76:AQ76))","v":0},"--",0,{"$f":"SUM(Table_2[[#This Row],[Column20]],Table_2[[#This Row],[Column19]],Table_2[[#This Row],[Column18]])","v":0},"HEALTH & PHY. EDU.",{"$f":"(M76/Instructions!$C$23)*100","v":0},{"$f":"(P76/Instructions!$C$24)*100","v":0},{"$f":"(S76/Instructions!$C$25)*100","v":0},{"$f":"(V76/Instructions!$C$26)*100","v":0},{"$f":"(Y76/Instructions!$C$27)*100","v":0},{"$f":"(AB76/Instructions!$C$28)*100","v":0},{"$f":"(AF76/Instructions!$C$29)*100","v":0},{"$f":"(AJ76/Instructions!$C$30)*100","v":0},{"$f":"(AN76/Instructions!$C$31)*100","v":0},0,{"$f":"(AS76/Instructions!$C$33)*100","v":{"$error":"#VALUE!"}},"----","E","E","E","E","E","E","E","E","E","E","--","E",null,null,null,null,{"$f":"Table_2[[#This Row],[Column51]]&Table_2[[#This Row],[Column52]]&BU78","v":""}]
[75,null,null,null,null,null,null,null,null,null,null,null,0,null,null,0,null,null,0,null,null,0,null,null,0,null,null,0,null,null,null,0,null,null,null,{"$f":"IF(AG77<Instructions!D106,AG77,SUM(AG77:AI77))","v":0},null,null,null,{"$f":"IF(AK77<Instructions!D105,AK77,SUM(AK77:AM77))","v":0},null,null,null,{"$f":"IF(AO77<Instructions!D104,AO77,SUM(AO77:AQ77))","v":0},"--",0,{"$f":"SUM(Table_2[[#This Row],[Column20]],Table_2[[#This Row],[Column19]],Table_2[[#This Row],[Column18]])","v":0},"HEALTH & PHY. EDU.",{"$f":"(M77/Instructions!$C$23)*100","v":0},{"$f":"(P77/Instructions!$C$24)*100","v":0},{"$f":"(S77/Instructions!$C$25)*100","v":0},{"$f":"(V77/Instructions!$C$26)*100","v":0},{"$f":"(Y77/Instructions!$C$27)*100","v":0},{"$f":"(AB77/Instructions!$C$28)*100","v":0},{"$f":"(AF77/Instructions!$C$29)*100","v":0},{"$f":"(AJ77/Instructions!$C$30)*100","v":0},{"$f":"(AN77/Instructions!$C$31)*100","v":0},0,{"$f":"(AS77/Instructions!$C$33)*100","v":{"$error":"#VALUE!"}},"----","E","E","E","E","E","E","E","E","E","E","--","E",null,null,null,null,{"$f":"Table_2[[#This Row],[Column51]]&Table_2[[#This Row],[Column52]]&BU79","v":""}]
[76,null,null,null,null,null,null,null,null,null,null,null,0,null,null,0,null,null,0,null,null,0,null,null,0,null,null,0,null,null,null,0,null,null,null,{"$f":"IF(AG78<Instructions!D107,AG78,SUM(AG78:AI78))","v":0},null,null,null,{"$f":"IF(AK78<Instructions!D106,AK78,SUM(AK78:AM78))","v":0},null,null,null,{"$f":"IF(AO78<Instructions!D105,AO78,SUM(AO78:AQ78))","v":0},"--",0,{"$f":"SUM(Table_2[[#This Row],[Column20]],Table_2[[#This Row],[Column19]],Table_2[[#This Row],[Column18]])","v":0},"HEALTH & PHY. EDU.",{"$f":"(M78/Instructions!$C$23)*100","v":0},{"$f":"(P78/Instructions!$C$24)*100","v":0},{"$f":"(S78/Instructions!$C$25)*100","v":0},{"$f":"(V78/Instructions!$C$26)*100","v":0},{"$f":"(Y78/Instructions!$C$27)*100","v":0},{"$f":"(AB78/Instructions!$C$28)*100","v":0},{"$f":"(AF78/Instructions!$C$29)*100","v":0},{"$f":"(AJ78/Instructions!$C$30)*100","v":0},{"$f":"(AN78/Instructions!$C$31)*100","v":0},0,{"$f":"(AS78/Instructions!$C$33)*100","v":{"$error":"#VALUE!"}},"----","E","E","E","E","E","E","E","E","E","E","--","E",null,null,null,null,{"$f":"Table_2[[#This Row],[Column51]]&Table_2[[#This Row],[Column52]]&BU80","v":""}]
[77,null,null,null,null,null,null,null,null,null,null,null,0,null,null,0,null,null,0,null,null,0,null,null,0,null,null,0,null,null,null,0,null,null,null,{"$f":"IF(AG79<Instructions!D108,AG79,SUM(AG79:AI79))","v":0},null,null,null,{"$f":"IF(AK79<Instructions!D107,AK79,SUM(AK79:AM79))","v":0},null,null,null,{"$f":"IF(AO79<Instructions!D106,AO79,SUM(AO79:AQ79))","v":0},"--",0,{"$f":"SUM(Table_2[[#This Row],[Column20]],Table_2[[#This Row],[Column19]],Table_2[[#This Row],[Column18]])","v":0},"HEALTH & PHY. EDU.",{"$f":"(M79/Instructions!$C$23)*100","v":0},{"$f":"(P79/Instructions!$C$24)*100","v":0},{"$f":"(S79/Instructions!$C$25)*100","v":0},{"$f":"(V79/Instructions!$C$26)*100","v":0},{"$f":"(Y79/Instructions!$C$27)*100","v":0},{"$f":"(AB79/Instructions!$C$28)*100","v":0},{"$f":"(AF79/Instructions!$C$29)*100","v":0},{"$f":"(AJ79/Instructions!$C$30)*100","v":0},{"$f":"(AN79/Instructions!$C$31)*100","v":0},0,{"$f":"(AS79/Instructions!$C$33)*100","v":{"$error":"#VALUE!"}},"----","E","E","E","E","E","E","E","E","E","E","--","E",null,null,null,null,{"$f":"Table_2[[#This Row],[Column51]]&Table_2[[#This Row],[Column52]]&BU81","v":""}]
[78,null,null,null,null,null,null,null,null,null,null,null,0,null,null,0,null,null,0,null,null,0,null,null,0,null,null,0,null,null,null,0,null,null,null,{"$f":"IF(AG80<Instructions!D109,AG80,SUM(AG80:AI80))","v":0},null,null,null,{"$f":"IF(AK80<Instructions!D108,AK80,SUM(AK80:AM80))","v":0},null,null,null,{"$f":"IF(AO80<Instructions!D107,AO80,SUM(AO80:AQ80))","v":0},"--",0,{"$f":"SUM(Table_2[[#This Row],[Column20]],Table_2[[#This Row],[Column19]],Table_2[[#This Row],[Column18]])","v":0},"HEALTH & PHY. EDU.",{"$f":"(M80/Instructions!$C$23)*100","v":0},{"$f":"(P80/Instructions!$C$24)*100","v":0},{"$f":"(S80/Instructions!$C$25)*100","v":0},{"$f":"(V80/Instructions!$C$26)*100","v":0},{"$f":"(Y80/Instructions!$C$27)*100","v":0},{"$f":"(AB80/Instructions!$C$28)*100","v":0},{"$f":"(AF80/Instructions!$C$29)*100","v":0},{"$f":"(AJ80/Instructions!$C$30)*100","v":0},{"$f":"(AN80/Instructions!$C$31)*100","v":0},0,{"$f":"(AS80/Instructions!$C$33)*100","v":{"$error":"#VALUE!"}},"----","E","E","E","E","E","E","E","E","E","E","--","E",null,null,null,null,{"$f":"Table_2[[#This Row],[Column51]]&Table_2[[#This Row],[Column52]]&BU82","v":""}]
[79,null,null,null,null,null,null,null,null,null,null,null,0,null,null,0,null,null,0,null,null,0,null,null,0,null,null,0,null,null,null,0,null,null,null,{"$f":"IF(AG81<Instructions!D110,AG81,SUM(AG81:AI81))","v":0},null,null,null,{"$f":"IF(AK81<Instructions!D109,AK81,SUM(AK81:AM81))","v":0},null,null,null,{"$f":"IF(AO81<Instructions!D108,AO81,SUM(AO81:AQ81))","v":0},"--",0,{"$f":"SUM(Table_2[[#This Row],[Column20]],Table_2[[#This Row],[Column19]],Table_2[[#This Row],[Column18]])","v":0},"HEALTH & PHY. EDU.",{"$f":"(M81/Instructions!$C$23)*100","v":0},{"$f":"(P81/Instructions!$C$24)*100","v":0},{"$f":"(S81/Instructions!$C$25)*100","v":0},{"$f":"(V81/Instructions!$C$26)*100","v":0},{"$f":"(Y81/Instructions!$C$27)*100","v":0},{"$f":"(AB81/Instructions!$C$28)*100","v":0},{"$f":"(AF81/Instructions!$C$29)*100","v":0},{"$f":"(AJ81/Instructions!$C$30)*100","v":0},{"$f":"(AN81/Instructions!$C$31)*100","v":0},0,{"$f":"(AS81/Instructions!$C$33)*100","v":{"$error":"#VALUE!"}},"----","E","E","E","E","E","E","E","E","E","E","--","E",null,null,null,null,{"$f":"Table_2[[#This Row],[Column51]]&Table_2[[#This Row],[Column52]]&BU83","v":""}]
[80,null,null,null,null,null,null,null,null,null,null,null,0,null,null,0,null,null,0,null,null,0,null,null,0,null,null,0,null,null,null,0,null,null,null,{"$f":"IF(AG82<Instructions!D111,AG82,SUM(AG82:AI82))","v":0},null,null,null,{"$f":"IF(AK82<Instructions!D110,AK82,SUM(AK82:AM82))","v":0},null,null,null,{"$f":"IF(AO82<Instructions!D109,AO82,SUM(AO82:AQ82))","v":0},"--",0,{"$f":"SUM(Table_2[[#This Row],[Column20]],Table_2[[#This Row],[Column19]],Table_2[[#This Row],[Column18]])","v":0},"HEALTH & PHY. EDU.",{"$f":"(M82/Instructions!$C$23)*100","v":0},{"$f":"(P82/Instructions!$C$24)*100","v":0},{"$f":"(S82/Instructions!$C$25)*100","v":0},{"$f":"(V82/Instructions!$C$26)*100","v":0},{"$f":"(Y82/Instructions!$C$27)*100","v":0},{"$f":"(AB82/Instructions!$C$28)*100","v":0},{"$f":"(AF82/Instructions!$C$29)*100","v":0},{"$f":"(AJ82/Instructions!$C$30)*100","v":0},{"$f":"(AN82/Instructions!$C$31)*100","v":0},0,{"$f":"(AS82/Instructions!$C$33)*100","v":{"$error":"#VALUE!"}},"----","E","E","E","E","E","E","E","E","E","E","--","E",null,null,null,null,{"$f":"Table_2[[#This Row],[Column51]]&Table_2[[#This Row],[Column52]]&BU84","v":""}]
[81,null,null,null,null,null,null,null,null,null,null,null,0,null,null,0,null,null,0,null,null,0,null,null,0,null,null,0,null,null,null,0,null,null,null,{"$f":"IF(AG83<Instructions!D112,AG83,SUM(AG83:AI83))","v":0},null,null,null,{"$f":"IF(AK83<Instructions!D111,AK83,SUM(AK83:AM83))","v":0},null,null,null,{"$f":"IF(AO83<Instructions!D110,AO83,SUM(AO83:AQ83))","v":0},"--",0,{"$f":"SUM(Table_2[[#This Row],[Column20]],Table_2[[#This Row],[Column19]],Table_2[[#This Row],[Column18]])","v":0},"HEALTH & PHY. EDU.",{"$f":"(M83/Instructions!$C$23)*100","v":0},{"$f":"(P83/Instructions!$C$24)*100","v":0},{"$f":"(S83/Instructions!$C$25)*100","v":0},{"$f":"(V83/Instructions!$C$26)*100","v":0},{"$f":"(Y83/Instructions!$C$27)*100","v":0},{"$f":"(AB83/Instructions!$C$28)*100","v":0},{"$f":"(AF83/Instructions!$C$29)*100","v":0},{"$f":"(AJ83/Instructions!$C$30)*100","v":0},{"$f":"(AN83/Instructions!$C$31)*100","v":0},0,{"$f":"(AS83/Instructions!$C$33)*100","v":{"$error":"#VALUE!"}},"----",{"$f":"IFERROR(IF(AW83>90,\"A+\",IF(AW83>80,\"A\",IF(AW83>70,\"B+\",IF(AW83>60,\"B\",IF(AW83>50,\"C+\",IF(AW83>40,\"C\",IF(AW83>=33,\"D\",\"E\"))))))),\"Abs\")","v":"E"},"E","E","E","E","E","E","E","E","E","--","E",null,null,null,null,{"$f":"Table_2[[#This Row],[Column51]]&Table_2[[#This Row],[Column52]]&BU85","v":""}]
[82,null,null,null,null,null,null,null,null,null,null,null,0,null,null,0,null,null,0,null,null,0,null,null,0,null,null,0,null,null,null,0,null,null,null,{"$f":"IF(AG84<Instructions!D113,AG84,SUM(AG84:AI84))","v":0},null,null,null,{"$f":"IF(AK84<Instructions!D112,AK84,SUM(AK84:AM84))","v":0},null,null,null,{"$f":"IF(AO84<Instructions!D111,AO84,SUM(AO84:AQ84))","v":0},"--",0,{"$f":"SUM(Table_2[[#This Row],[Column20]],Table_2[[#This Row],[Column19]],Table_2[[#This Row],[Column18]])","v":0},"HEALTH & PHY. EDU.",{"$f":"(M84/Instructions!$C$23)*100","v":0},{"$f":"(P84/Instructions!$C$24)*100","v":0},{"$f":"(S84/Instructions!$C$25)*100","v":0},{"$f":"(V84/Instructions!$C$26)*100","v":0},{"$f":"(Y84/Instructions!$C$27)*100","v":0},{"$f":"(AB84/Instructions!$C$28)*100","v":0},{"$f":"(AF84/Instructions!$C$29)*100","v":0},{"$f":"(AJ84/Instructions!$C$30)*100","v":0},{"$f":"(AN84/Instructions!$C$31)*100","v":0},0,{"$f":"(AS84/Instructions!$C$33)*100","v":{"$error":"#VALUE!"}},"----","E","E","E","E","E","E","E","E","E","E","--","E",null,null,null,null,{"$f":"Table_2[[#This Row],[Column51]]&Table_2[[#This Row],[Column52]]&BU86","v":""}]
[83,null,null,null,null,null,null,null,null,null,null,null,0,null,null,0,null,null,0,null,null,0,null,null,0,null,null,0,null,null,null,0,null,null,null,{"$f":"IF(AG85<Instructions!D114,AG85,SUM(AG85:AI85))","v":0},null,null,null,{"$f":"IF(AK85<Instructions!D113,AK85,SUM(AK85:AM85))","v":0},null,null,null,{"$f":"IF(AO85<Instructions!D112,AO85,SUM(AO85:AQ85))","v":0},"--",0,{"$f":"SUM(Table_2[[#This Row],[Column20]],Table_2[[#This Row],[Column19]],Table_2[[#This Row],[Column18]])","v":0},"HEALTH & PHY. EDU.",{"$f":"(M85/Instructions!$C$23)*100","v":0},{"$f":"(P85/Instructions!$C$24)*100","v":0},{"$f":"(S85/Instructions!$C$25)*100","v":0},{"$f":"(V85/Instructions!$C$26)*100","v":0},{"$f":"(Y85/Instructions!$C$27)*100","v":0},{"$f":"(AB85/Instructions!$C$28)*100","v":0},{"$f":"(AF85/Instructions!$C$29)*100","v":0},{"$f":"(AJ85/Instructions!$C$30)*100","v":0},{"$f":"(AN85/Instructions!$C$31)*100","v":0},0,{"$f":"(AS85/Instructions!$C$33)*100","v":{"$error":"#VALUE!"}},"----","E","E","E","E","E","E","E","E","E","E","--","E",null,null,null,null,{"$f":"Table_2[[#This Row],[Column51]]&Table_2[[#This Row],[Column52]]&BU87","v":""}]
[84,null,null,null,null,null,null,null,null,null,null,null,0,null,null,0,null,null,0,null,null,0,null,null,0,null,null,0,null,null,null,0,null,null,null,{"$f":"IF(AG86<Instructions!D115,AG86,SUM(AG86:AI86))","v":0},null,null,null,{"$f":"IF(AK86<Instructions!D114,AK86,SUM(AK86:AM86))","v":0},null,null,null,{"$f":"IF(AO86<Instructions!D113,AO86,SUM(AO86:AQ86))","v":0},"--",0,{"$f":"SUM(Table_2[[#This Row],[Column20]],Table_2[[#This Row],[Column19]],Table_2[[#This Row],[Column18]])","v":0},"HEALTH & PHY. EDU.",{"$f":"(M86/Instructions!$C$23)*100","v":0},{"$f":"(P86/Instructions!$C$24)*100","v":0},{"$f":"(S86/Instructions!$C$25)*100","v":0},{"$f":"(V86/Instructions!$C$26)*100","v":0},{"$f":"(Y86/Instructions!$C$27)*100","v":0},{"$f":"(AB86/Instructions!$C$28)*100","v":0},{"$f":"(AF86/Instructions!$C$29)*100","v":0},{"$f":"(AJ86/Instructions!$C$30)*100","v":0},{"$f":"(AN86/Instructions!$C$31)*100","v":0},0,{"$f":"(AS86/Instructions!$C$33)*100","v":{"$error":"#VALUE!"}},"----","E","E","E","E","E","E","E","E","E","E","--","E",null,null,null,null,{"$f":"Table_2[[#This Row],[Column51]]&Table_2[[#This Row],[Column52]]&BU88","v":""}]
[85,null,null,null,null,null,null,null,null,null,null,null,0,null,null,0,null,null,0,null,null,0,null,null,0,null,null,0,null,null,null,0,null,null,null,{"$f":"IF(AG87<Instructions!D116,AG87,SUM(AG87:AI87))","v":0},null,null,null,{"$f":"IF(AK87<Instructions!D115,AK87,SUM(AK87:AM87))","v":0},null,null,null,{"$f":"IF(AO87<Instructions!D114,AO87,SUM(AO87:AQ87))","v":0},"--",0,{"$f":"SUM(Table_2[[#This Row],[Column20]],Table_2[[#This Row],[Column19]],Table_2[[#This Row],[Column18]])","v":0},"HEALTH & PHY. EDU.",{"$f":"(M87/Instructions!$C$23)*100","v":0},{"$f":"(P87/Instructions!$C$24)*100","v":0},{"$f":"(S87/Instructions!$C$25)*100","v":0},{"$f":"(V87/Instructions!$C$26)*100","v":0},{"$f":"(Y87/Instructions!$C$27)*100","v":0},{"$f":"(AB87/Instructions!$C$28)*100","v":0},{"$f":"(AF87/Instructions!$C$29)*100","v":0},{"$f":"(AJ87/Instructions!$C$30)*100","v":0},{"$f":"(AN87/Instructions!$C$31)*100","v":0},0,{"$f":"(AS87/Instructions!$C$33)*100","v":{"$error":"#VALUE!"}},"----","E","E","E","E","E","E","E","E","E","E","--","E",null,null,null,null,{"$f":"Table_2[[#This Row],[Column51]]&Table_2[[#This Row],[Column52]]&BU89","v":""}]
[86,null,null,null,null,null,null,null,null,null,null,null,0,null,null,0,null,null,0,null,null,0,null,null,0,null,null,0,null,null,null,0,null,null,null,{"$f":"IF(AG88<Instructions!D117,AG88,SUM(AG88:AI88))","v":0},null,null,null,{"$f":"IF(AK88<Instructions!D116,AK88,SUM(AK88:AM88))","v":0},null,null,null,{"$f":"IF(AO88<Instructions!D115,AO88,SUM(AO88:AQ88))","v":0},"--",0,{"$f":"SUM(Table_2[[#This Row],[Column20]],Table_2[[#This Row],[Column19]],Table_2[[#This Row],[Column18]])","v":0},"HEALTH & PHY. EDU.",{"$f":"(M88/Instructions!$C$23)*100","v":0},{"$f":"(P88/Instructions!$C$24)*100","v":0},{"$f":"(S88/Instructions!$C$25)*100","v":0},{"$f":"(V88/Instructions!$C$26)*100","v":0},{"$f":"(Y88/Instructions!$C$27)*100","v":0},{"$f":"(AB88/Instructions!$C$28)*100","v":0},{"$f":"(AF88/Instructions!$C$29)*100","v":0},{"$f":"(AJ88/Instructions!$C$30)*100","v":0},{"$f":"(AN88/Instructions!$C$31)*100","v":0},0,{"$f":"(AS88/Instructions!$C$33)*100","v":{"$error":"#VALUE!"}},"----","E","E","E","E","E","E","E","E","E","E","--","E",null,null,null,null,{"$f":"Table_2[[#This Row],[Column51]]&Table_2[[#This Row],[Column52]]&BU90","v":""}]
[87,null,null,null,null,null,null,null,null,null,null,null,0,null,null,0,null,null,0,null,null,0,null,null,0,null,null,0,null,null,null,0,null,null,null,{"$f":"IF(AG89<Instructions!D118,AG89,SUM(AG89:AI89))","v":0},null,null,null,{"$f":"IF(AK89<Instructions!D117,AK89,SUM(AK89:AM89))","v":0},null,null,null,{"$f":"IF(AO89<Instructions!D116,AO89,SUM(AO89:AQ89))","v":0},"--",0,{"$f":"SUM(Table_2[[#This Row],[Column20]],Table_2[[#This Row],[Column19]],Table_2[[#This Row],[Column18]])","v":0},"HEALTH & PHY. EDU.",{"$f":"(M89/Instructions!$C$23)*100","v":0},{"$f":"(P89/Instructions!$C$24)*100","v":0},{"$f":"(S89/Instructions!$C$25)*100","v":0},{"$f":"(V89/Instructions!$C$26)*100","v":0},{"$f":"(Y89/Instructions!$C$27)*100","v":0},{"$f":"(AB89/Instructions!$C$28)*100","v":0},{"$f":"(AF89/Instructions!$C$29)*100","v":0},{"$f":"(AJ89/Instructions!$C$30)*100","v":0},{"$f":"(AN89/Instructions!$C$31)*100","v":0},0,{"$f":"(AS89/Instructions!$C$33)*100","v":{"$error":"#VALUE!"}},"----","E","E","E","E","E","E","E","E","E","E","--","E",null,null,null,null,{"$f":"Table_2[[#This Row],[Column51]]&Table_2[[#This Row],[Column52]]&BU91","v":""}]
[88,null,null,null,null,null,null,null,null,null,null,null,0,null,null,0,null,null,0,null,null,0,null,null,0,null,null,0,null,null,null,0,null,null,null,{"$f":"IF(AG90<Instructions!D119,AG90,SUM(AG90:AI90))","v":0},null,null,null,{"$f":"IF(AK90<Instructions!D118,AK90,SUM(AK90:AM90))","v":0},null,null,null,{"$f":"IF(AO90<Instructions!D117,AO90,SUM(AO90:AQ90))","v":0},"--",0,{"$f":"SUM(Table_2[[#This Row],[Column20]],Table_2[[#This Row],[Column19]],Table_2[[#This Row],[Column18]])","v":0},"HEALTH & PHY. EDU.",{"$f":"(M90/Instructions!$C$23)*100","v":0},{"$f":"(P90/Instructions!$C$24)*100","v":0},{"$f":"(S90/Instructions!$C$25)*100","v":0},{"$f":"(V90/Instructions!$C$26)*100","v":0},{"$f":"(Y90/Instructions!$C$27)*100","v":0},{"$f":"(AB90/Instructions!$C$28)*100","v":0},{"$f":"(AF90/Instructions!$C$29)*100","v":0},{"$f":"(AJ90/Instructions!$C$30)*100","v":0},{"$f":"(AN90/Instructions!$C$31)*100","v":0},0,{"$f":"(AS90/Instructions!$C$33)*100","v":{"$error":"#VALUE!"}},"----","E","E","E","E","E","E","E","E","E","E","--","E",null,null,null,null,{"$f":"Table_2[[#This Row],[Column51]]&Table_2[[#This Row],[Column52]]&BU92","v":""}]
[89,null,null,null,null,null,null,null,null,null,null,null,0,null,null,0,null,null,0,null,null,0,null,null,0,null,null,0,null,null,null,0,null,null,null,{"$f":"IF(AG91<Instructions!D120,AG91,SUM(AG91:AI91))","v":0},null,null,null,{"$f":"IF(AK91<Instructions!D119,AK91,SUM(AK91:AM91))","v":0},null,null,null,{"$f":"IF(AO91<Instructions!D118,AO91,SUM(AO91:AQ91))","v":0},"--",0,{"$f":"SUM(Table_2[[#This Row],[Column20]],Table_2[[#This Row],[Column19]],Table_2[[#This Row],[Column18]])","v":0},"HEALTH & PHY. EDU.",{"$f":"(M91/Instructions!$C$23)*100","v":0},{"$f":"(P91/Instructions!$C$24)*100","v":0},{"$f":"(S91/Instructions!$C$25)*100","v":0},{"$f":"(V91/Instructions!$C$26)*100","v":0},{"$f":"(Y91/Instructions!$C$27)*100","v":0},{"$f":"(AB91/Instructions!$C$28)*100","v":0},{"$f":"(AF91/Instructions!$C$29)*100","v":0},{"$f":"(AJ91/Instructions!$C$30)*100","v":0},{"$f":"(AN91/Instructions!$C$31)*100","v":0},0,{"$f":"(AS91/Instructions!$C$33)*100","v":{"$error":"#VALUE!"}},"----","E","E","E","E","E","E","E","E","E","E","--","E",null,null,null,null,{"$f":"Table_2[[#This Row],[Column51]]&Table_2[[#This Row],[Column52]]&BU93","v":""}]
[90,null,null,null,null,null,null,null,null,null,null,null,0,null,null,0,null,null,0,null,null,0,null,null,0,null,null,0,null,null,null,0,null,null,null,{"$f":"IF(AG92<Instructions!D121,AG92,SUM(AG92:AI92))","v":0},null,null,null,{"$f":"IF(AK92<Instructions!D120,AK92,SUM(AK92:AM92))","v":0},null,null,null,{"$f":"IF(AO92<Instructions!D119,AO92,SUM(AO92:AQ92))","v":0},"--",0,{"$f":"SUM(Table_2[[#This Row],[Column20]],Table_2[[#This Row],[Column19]],Table_2[[#This Row],[Column18]])","v":0},"HEALTH & PHY. EDU.",{"$f":"(M92/Instructions!$C$23)*100","v":0},{"$f":"(P92/Instructions!$C$24)*100","v":0},{"$f":"(S92/Instructions!$C$25)*100","v":0},{"$f":"(V92/Instructions!$C$26)*100","v":0},{"$f":"(Y92/Instructions!$C$27)*100","v":0},{"$f":"(AB92/Instructions!$C$28)*100","v":0},{"$f":"(AF92/Instructions!$C$29)*100","v":0},{"$f":"(AJ92/Instructions!$C$30)*100","v":0},{"$f":"(AN92/Instructions!$C$31)*100","v":0},0,{"$f":"(AS92/Instructions!$C$33)*100","v":{"$error":"#VALUE!"}},"----","E","E","E","E","E","E","E","E","E","E","--","E",null,null,null,null,{"$f":"Table_2[[#This Row],[Column51]]&Table_2[[#This Row],[Column52]]&BU94","v":""}]
[91,null,null,null,null,null,null,null,null,null,null,null,0,null,null,0,null,null,0,null,null,0,null,null,0,null,null,0,null,null,null,0,null,null,null,{"$f":"IF(AG93<Instructions!D122,AG93,SUM(AG93:AI93))","v":0},null,null,null,{"$f":"IF(AK93<Instructions!D121,AK93,SUM(AK93:AM93))","v":0},null,null,null,{"$f":"IF(AO93<Instructions!D120,AO93,SUM(AO93:AQ93))","v":0},"--",0,{"$f":"SUM(Table_2[[#This Row],[Column20]],Table_2[[#This Row],[Column19]],Table_2[[#This Row],[Column18]])","v":0},"HEALTH & PHY. EDU.",{"$f":"(M93/Instructions!$C$23)*100","v":0},{"$f":"(P93/Instructions!$C$24)*100","v":0},{"$f":"(S93/Instructions!$C$25)*100","v":0},{"$f":"(V93/Instructions!$C$26)*100","v":0},{"$f":"(Y93/Instructions!$C$27)*100","v":0},{"$f":"(AB93/Instructions!$C$28)*100","v":0},{"$f":"(AF93/Instructions!$C$29)*100","v":0},{"$f":"(AJ93/Instructions!$C$30)*100","v":0},{"$f":"(AN93/Instructions!$C$31)*100","v":0},0,{"$f":"(AS93/Instructions!$C$33)*100","v":{"$error":"#VALUE!"}},"----","E","E","E","E","E","E","E","E","E","E","--","E",null,null,null,null,{"$f":"Table_2[[#This Row],[Column51]]&Table_2[[#This Row],[Column52]]&BU95","v":""}]
[92,null,null,null,null,null,null,null,null,null,null,null,0,null,null,0,null,null,0,null,null,0,null,null,0,null,null,0,null,null,null,0,null,null,null,{"$f":"IF(AG94<Instructions!D123,AG94,SUM(AG94:AI94))","v":0},null,null,null,{"$f":"IF(AK94<Instructions!D122,AK94,SUM(AK94:AM94))","v":0},null,null,null,{"$f":"IF(AO94<Instructions!D121,AO94,SUM(AO94:AQ94))","v":0},"--",0,{"$f":"SUM(Table_2[[#This Row],[Column20]],Table_2[[#This Row],[Column19]],Table_2[[#This Row],[Column18]])","v":0},"HEALTH & PHY. EDU.",{"$f":"(M94/Instructions!$C$23)*100","v":0},{"$f":"(P94/Instructions!$C$24)*100","v":0},{"$f":"(S94/Instructions!$C$25)*100","v":0},{"$f":"(V94/Instructions!$C$26)*100","v":0},{"$f":"(Y94/Instructions!$C$27)*100","v":0},{"$f":"(AB94/Instructions!$C$28)*100","v":0},{"$f":"(AF94/Instructions!$C$29)*100","v":0},{"$f":"(AJ94/Instructions!$C$30)*100","v":0},{"$f":"(AN94/Instructions!$C$31)*100","v":0},0,{"$f":"(AS94/Instructions!$C$33)*100","v":{"$error":"#VALUE!"}},"----","E","E","E","E","E","E","E","E","E","E","--","E",null,null,null,null,{"$f":"Table_2[[#This Row],[Column51]]&Table_2[[#This Row],[Column52]]&BU96","v":""}]
[93,null,null,null,null,null,null,null,null,null,null,null,0,null,null,0,null,null,0,null,null,0,null,null,0,null,null,0,null,null,null,0,null,null,null,{"$f":"IF(AG95<Instructions!D124,AG95,SUM(AG95:AI95))","v":0},null,null,null,{"$f":"IF(AK95<Instructions!D123,AK95,SUM(AK95:AM95))","v":0},null,null,null,{"$f":"IF(AO95<Instructions!D122,AO95,SUM(AO95:AQ95))","v":0},"--",0,{"$f":"SUM(Table_2[[#This Row],[Column20]],Table_2[[#This Row],[Column19]],Table_2[[#This Row],[Column18]])","v":0},"HEALTH & PHY. EDU.",{"$f":"(M95/Instructions!$C$23)*100","v":0},{"$f":"(P95/Instructions!$C$24)*100","v":0},{"$f":"(S95/Instructions!$C$25)*100","v":0},{"$f":"(V95/Instructions!$C$26)*100","v":0},{"$f":"(Y95/Instructions!$C$27)*100","v":0},{"$f":"(AB95/Instructions!$C$28)*100","v":0},{"$f":"(AF95/Instructions!$C$29)*100","v":0},{"$f":"(AJ95/Instructions!$C$30)*100","v":0},{"$f":"(AN95/Instructions!$C$31)*100","v":0},0,{"$f":"(AS95/Instructions!$C$33)*100","v":{"$error":"#VALUE!"}},"----","E","E","E","E","E","E","E","E","E","E","--","E",null,null,null,null,{"$f":"Table_2[[#This Row],[Column51]]&Table_2[[#This Row],[Column52]]&BU97","v":""}]
[94,null,null,null,null,null,null,null,null,null,null,null,0,null,null,0,null,null,0,null,null,0,null,null,0,null,null,0,null,null,null,0,null,null,null,{"$f":"IF(AG96<Instructions!D125,AG96,SUM(AG96:AI96))","v":0},null,null,null,{"$f":"IF(AK96<Instructions!D124,AK96,SUM(AK96:AM96))","v":0},null,null,null,{"$f":"IF(AO96<Instructions!D123,AO96,SUM(AO96:AQ96))","v":0},"--",0,{"$f":"SUM(Table_2[[#This Row],[Column20]],Table_2[[#This Row],[Column19]],Table_2[[#This Row],[Column18]])","v":0},"HEALTH & PHY. EDU.",{"$f":"(M96/Instructions!$C$23)*100","v":0},{"$f":"(P96/Instructions!$C$24)*100","v":0},{"$f":"(S96/Instructions!$C$25)*100","v":0},{"$f":"(V96/Instructions!$C$26)*100","v":0},{"$f":"(Y96/Instructions!$C$27)*100","v":0},{"$f":"(AB96/Instructions!$C$28)*100","v":0},{"$f":"(AF96/Instructions!$C$29)*100","v":0},{"$f":"(AJ96/Instructions!$C$30)*100","v":0},{"$f":"(AN96/Instructions!$C$31)*100","v":0},0,{"$f":"(AS96/Instructions!$C$33)*100","v":{"$error":"#VALUE!"}},"----","E","E","E","E","E","E","E","E","E","E","--","E",null,null,null,null,{"$f":"Table_2[[#This Row],[Column51]]&Table_2[[#This Row],[Column52]]&BU98","v":""}]
[95,null,null,null,null,null,null,null,null,null,null,null,0,null,null,0,null,null,0,null,null,0,null,null,0,null,null,0,null,null,null,0,null,null,null,{"$f":"IF(AG97<Instructions!D126,AG97,SUM(AG97:AI97))","v":0},null,null,null,{"$f":"IF(AK97<Instructions!D125,AK97,SUM(AK97:AM97))","v":0},null,null,null,{"$f":"IF(AO97<Instructions!D124,AO97,SUM(AO97:AQ97))","v":0},"--",0,{"$f":"SUM(Table_2[[#This Row],[Column20]],Table_2[[#This Row],[Column19]],Table_2[[#This Row],[Column18]])","v":0},"HEALTH & PHY. EDU.",{"$f":"(M97/Instructions!$C$23)*100","v":0},{"$f":"(P97/Instructions!$C$24)*100","v":0},{"$f":"(S97/Instructions!$C$25)*100","v":0},{"$f":"(V97/Instructions!$C$26)*100","v":0},{"$f":"(Y97/Instructions!$C$27)*100","v":0},{"$f":"(AB97/Instructions!$C$28)*100","v":0},{"$f":"(AF97/Instructions!$C$29)*100","v":0},{"$f":"(AJ97/Instructions!$C$30)*100","v":0},{"$f":"(AN97/Instructions!$C$31)*100","v":0},0,{"$f":"(AS97/Instructions!$C$33)*100","v":{"$error":"#VALUE!"}},"----","E","E","E","E","E","E","E","E","E","E","--","E",null,null,null,null,{"$f":"Table_2[[#This Row],[Column51]]&Table_2[[#This Row],[Column52]]&BU99","v":""}]
[96,null,null,null,null,null,null,null,null,null,null,null,0,null,null,0,null,null,0,null,null,0,null,null,0,null,null,0,null,null,null,0,null,null,null,{"$f":"IF(AG98<Instructions!D127,AG98,SUM(AG98:AI98))","v":0},null,null,null,{"$f":"IF(AK98<Instructions!D126,AK98,SUM(AK98:AM98))","v":0},null,null,null,{"$f":"IF(AO98<Instructions!D125,AO98,SUM(AO98:AQ98))","v":0},"--",0,{"$f":"SUM(Table_2[[#This Row],[Column20]],Table_2[[#This Row],[Column19]],Table_2[[#This Row],[Column18]])","v":0},"HEALTH & PHY. EDU.",{"$f":"(M98/Instructions!$C$23)*100","v":0},{"$f":"(P98/Instructions!$C$24)*100","v":0},{"$f":"(S98/Instructions!$C$25)*100","v":0},{"$f":"(V98/Instructions!$C$26)*100","v":0},{"$f":"(Y98/Instructions!$C$27)*100","v":0},{"$f":"(AB98/Instructions!$C$28)*100","v":0},{"$f":"(AF98/Instructions!$C$29)*100","v":0},{"$f":"(AJ98/Instructions!$C$30)*100","v":0},{"$f":"(AN98/Instructions!$C$31)*100","v":0},0,{"$f":"(AS98/Instructions!$C$33)*100","v":{"$error":"#VALUE!"}},"----","E","E","E","E","E","E","E","E","E","E","--","E",null,null,null,null,{"$f":"Table_2[[#This Row],[Column51]]&Table_2[[#This Row],[Column52]]&BU100","v":""}]
[97,null,null,null,null,null,null,null,null,null,null,null,0,null,null,0,null,null,0,null,null,0,null,null,0,null,null,0,null,null,null,0,null,null,null,{"$f":"IF(AG99<Instructions!D128,AG99,SUM(AG99:AI99))","v":0},null,null,null,{"$f":"IF(AK99<Instructions!D127,AK99,SUM(AK99:AM99))","v":0},null,null,null,{"$f":"IF(AO99<Instructions!D126,AO99,SUM(AO99:AQ99))","v":0},"--",0,{"$f":"SUM(Table_2[[#This Row],[Column20]],Table_2[[#This Row],[Column19]],Table_2[[#This Row],[Column18]])","v":0},"HEALTH & PHY. EDU.",{"$f":"(M99/Instructions!$C$23)*100","v":0},{"$f":"(P99/Instructions!$C$24)*100","v":0},{"$f":"(S99/Instructions!$C$25)*100","v":0},{"$f":"(V99/Instructions!$C$26)*100","v":0},{"$f":"(Y99/Instructions!$C$27)*100","v":0},{"$f":"(AB99/Instructions!$C$28)*100","v":0},{"$f":"(AF99/Instructions!$C$29)*100","v":0},{"$f":"(AJ99/Instructions!$C$30)*100","v":0},{"$f":"(AN99/Instructions!$C$31)*100","v":0},0,{"$f":"(AS99/Instructions!$C$33)*100","v":{"$error":"#VALUE!"}},"----","E","E","E","E","E","E","E","E","E","E","--","E",null,null,null,null,{"$f":"Table_2[[#This Row],[Column51]]&Table_2[[#This Row],[Column52]]&BU101","v":""}]
[98,null,null,null,null,null,null,null,null,null,null,null,0,null,null,0,null,null,0,null,null,0,null,null,0,null,null,0,null,null,null,0,null,null,null,{"$f":"IF(AG100<Instructions!D129,AG100,SUM(AG100:AI100))","v":0},null,null,null,{"$f":"IF(AK100<Instructions!D128,AK100,SUM(AK100:AM100))","v":0},null,null,null,{"$f":"IF(AO100<Instructions!D127,AO100,SUM(AO100:AQ100))","v":0},"--",0,{"$f":"SUM(Table_2[[#This Row],[Column20]],Table_2[[#This Row],[Column19]],Table_2[[#This Row],[Column18]])","v":0},"HEALTH & PHY. EDU.",{"$f":"(M100/Instructions!$C$23)*100","v":0},{"$f":"(P100/Instructions!$C$24)*100","v":0},{"$f":"(S100/Instructions!$C$25)*100","v":0},{"$f":"(V100/Instructions!$C$26)*100","v":0},{"$f":"(Y100/Instructions!$C$27)*100","v":0},{"$f":"(AB100/Instructions!$C$28)*100","v":0},{"$f":"(AF100/Instructions!$C$29)*100","v":0},{"$f":"(AJ100/Instructions!$C$30)*100","v":0},{"$f":"(AN100/Instructions!$C$31)*100","v":0},0,{"$f":"(AS100/Instructions!$C$33)*100","v":{"$error":"#VALUE!"}},"----","E","E","E","E","E","E","E","E","E","E","--","E",null,null,null,null,{"$f":"Table_2[[#This Row],[Column51]]&Table_2[[#This Row],[Column52]]&BU102","v":""}]
[99,null,null,null,null,null,null,null,null,null,null,null,0,null,null,0,null,null,0,null,null,0,null,null,0,null,null,0,null,null,null,0,null,null,null,{"$f":"IF(AG101<Instructions!D130,AG101,SUM(AG101:AI101))","v":0},null,null,null,{"$f":"IF(AK101<Instructions!D129,AK101,SUM(AK101:AM101))","v":0},null,null,null,{"$f":"IF(AO101<Instructions!D128,AO101,SUM(AO101:AQ101))","v":0},"--",0,{"$f":"SUM(Table_2[[#This Row],[Column20]],Table_2[[#This Row],[Column19]],Table_2[[#This Row],[Column18]])","v":0},"HEALTH & PHY. EDU.",{"$f":"(M101/Instructions!$C$23)*100","v":0},{"$f":"(P101/Instructions!$C$24)*100","v":0},{"$f":"(S101/Instructions!$C$25)*100","v":0},{"$f":"(V101/Instructions!$C$26)*100","v":0},{"$f":"(Y101/Instructions!$C$27)*100","v":0},{"$f":"(AB101/Instructions!$C$28)*100","v":0},{"$f":"(AF101/Instructions!$C$29)*100","v":0},{"$f":"(AJ101/Instructions!$C$30)*100","v":0},{"$f":"(AN101/Instructions!$C$31)*100","v":0},0,{"$f":"(AS101/Instructions!$C$33)*100","v":{"$error":"#VALUE!"}},"----","E","E","E","E","E","E","E","E","E","E","--","E",null,null,null,null,{"$f":"Table_2[[#This Row],[Column51]]&Table_2[[#This Row],[Column52]]&BU103","v":""}]
[100,null,null,null,null,null,null,null,null,null,null,null,0,null,null,0,null,null,0,null,null,0,null,null,0,null,null,0,null,null,null,0,null,null,null,{"$f":"IF(AG102<Instructions!D131,AG102,SUM(AG102:AI102))","v":0},null,null,null,{"$f":"IF(AK102<Instructions!D130,AK102,SUM(AK102:AM102))","v":0},null,null,null,{"$f":"IF(AO102<Instructions!D129,AO102,SUM(AO102:AQ102))","v":0},"--",0,{"$f":"SUM(Table_2[[#This Row],[Column20]],Table_2[[#This Row],[Column19]],Table_2[[#This Row],[Column18]])","v":0},"HEALTH & PHY. EDU.",{"$f":"(M102/Instructions!$C$23)*100","v":0},{"$f":"(P102/Instructions!$C$24)*100","v":0},{"$f":"(S102/Instructions!$C$25)*100","v":0},{"$f":"(V102/Instructions!$C$26)*100","v":0},{"$f":"(Y102/Instructions!$C$27)*100","v":0},{"$f":"(AB102/Instructions!$C$28)*100","v":0},{"$f":"(AF102/Instructions!$C$29)*100","v":0},{"$f":"(AJ102/Instructions!$C$30)*100","v":0},{"$f":"(AN102/Instructions!$C$31)*100","v":0},0,{"$f":"(AS102/Instructions!$C$33)*100","v":{"$error":"#VALUE!"}},"----","E","E","E","E","E","E","E","E","E","E","--","E",null,null,null,null,{"$f":"Table_2[[#This Row],[Column51]]&Table_2[[#This Row],[Column52]]&BU104","v":""}]
[101,null,null,null,null,null,null,null,null,null,null,null,0,null,null,0,null,null,0,null,null,0,null,null,0,null,null,0,null,null,null,0,null,null,null,{"$f":"IF(AG103<Instructions!D132,AG103,SUM(AG103:AI103))","v":0},null,null,null,{"$f":"IF(AK103<Instructions!D131,AK103,SUM(AK103:AM103))","v":0},null,null,null,{"$f":"IF(AO103<Instructions!D130,AO103,SUM(AO103:AQ103))","v":0},"--",0,{"$f":"SUM(Table_2[[#This Row],[Column20]],Table_2[[#This Row],[Column19]],Table_2[[#This Row],[Column18]])","v":0},"HEALTH & PHY. EDU.",{"$f":"(M103/Instructions!$C$23)*100","v":0},{"$f":"(P103/Instructions!$C$24)*100","v":0},{"$f":"(S103/Instructions!$C$25)*100","v":0},{"$f":"(V103/Instructions!$C$26)*100","v":0},{"$f":"(Y103/Instructions!$C$27)*100","v":0},{"$f":"(AB103/Instructions!$C$28)*100","v":0},{"$f":"(AF103/Instructions!$C$29)*100","v":0},{"$f":"(AJ103/Instructions!$C$30)*100","v":0},{"$f":"(AN103/Instructions!$C$31)*100","v":0},0,{"$f":"(AS103/Instructions!$C$33)*100","v":{"$error":"#VALUE!"}},"----","E","E","E","E","E","E","E","E","E","E","--","E",null,null,null,null,{"$f":"Table_2[[#This Row],[Column51]]&Table_2[[#This Row],[Column52]]&BU105","v":""}]
[102,null,null,null,null,null,null,null,null,null,null,null,0,null,null,0,null,null,0,null,null,0,null,null,0,null,null,0,null,null,null,0,null,null,null,{"$f":"IF(AG104<Instructions!D133,AG104,SUM(AG104:AI104))","v":0},null,null,null,{"$f":"IF(AK104<Instructions!D132,AK104,SUM(AK104:AM104))","v":0},null,null,null,{"$f":"IF(AO104<Instructions!D131,AO104,SUM(AO104:AQ104))","v":0},"--",0,{"$f":"SUM(Table_2[[#This Row],[Column20]],Table_2[[#This Row],[Column19]],Table_2[[#This Row],[Column18]])","v":0},"HEALTH & PHY. EDU.",{"$f":"(M104/Instructions!$C$23)*100","v":0},{"$f":"(P104/Instructions!$C$24)*100","v":0},{"$f":"(S104/Instructions!$C$25)*100","v":0},{"$f":"(V104/Instructions!$C$26)*100","v":0},{"$f":"(Y104/Instructions!$C$27)*100","v":0},{"$f":"(AB104/Instructions!$C$28)*100","v":0},{"$f":"(AF104/Instructions!$C$29)*100","v":0},{"$f":"(AJ104/Instructions!$C$30)*100","v":0},{"$f":"(AN104/Instructions!$C$31)*100","v":0},0,{"$f":"(AS104/Instructions!$C$33)*100","v":{"$error":"#VALUE!"}},"----","E","E","E","E","E","E","E","E","E","E","--","E",null,null,null,null,{"$f":"Table_2[[#This Row],[Column51]]&Table_2[[#This Row],[Column52]]&BU106","v":""}]
[103,null,null,null,null,null,null,null,null,null,null,null,0,null,null,0,null,null,0,null,null,0,null,null,0,null,null,0,null,null,null,0,null,null,null,{"$f":"IF(AG105<Instructions!D134,AG105,SUM(AG105:AI105))","v":0},null,null,null,{"$f":"IF(AK105<Instructions!D133,AK105,SUM(AK105:AM105))","v":0},null,null,null,{"$f":"IF(AO105<Instructions!D132,AO105,SUM(AO105:AQ105))","v":0},"--",0,{"$f":"SUM(Table_2[[#This Row],[Column20]],Table_2[[#This Row],[Column19]],Table_2[[#This Row],[Column18]])","v":0},"HEALTH & PHY. EDU.",{"$f":"(M105/Instructions!$C$23)*100","v":0},{"$f":"(P105/Instructions!$C$24)*100","v":0},{"$f":"(S105/Instructions!$C$25)*100","v":0},{"$f":"(V105/Instructions!$C$26)*100","v":0},{"$f":"(Y105/Instructions!$C$27)*100","v":0},{"$f":"(AB105/Instructions!$C$28)*100","v":0},{"$f":"(AF105/Instructions!$C$29)*100","v":0},{"$f":"(AJ105/Instructions!$C$30)*100","v":0},{"$f":"(AN105/Instructions!$C$31)*100","v":0},0,{"$f":"(AS105/Instructions!$C$33)*100","v":{"$error":"#VALUE!"}},"----","E","E","E","E","E","E","E","E","E","E","--","E",null,null,null,null,{"$f":"Table_2[[#This Row],[Column51]]&Table_2[[#This Row],[Column52]]&BU107","v":""}]
[104,null,null,null,null,null,null,null,null,null,null,null,0,null,null,0,null,null,0,null,null,0,null,null,0,null,null,0,null,null,null,0,null,null,null,{"$f":"IF(AG106<Instructions!D135,AG106,SUM(AG106:AI106))","v":0},null,null,null,{"$f":"IF(AK106<Instructions!D134,AK106,SUM(AK106:AM106))","v":0},null,null,null,{"$f":"IF(AO106<Instructions!D133,AO106,SUM(AO106:AQ106))","v":0},"--",0,{"$f":"SUM(Table_2[[#This Row],[Column20]],Table_2[[#This Row],[Column19]],Table_2[[#This Row],[Column18]])","v":0},"HEALTH & PHY. EDU.",{"$f":"(M106/Instructions!$C$23)*100","v":0},{"$f":"(P106/Instructions!$C$24)*100","v":0},{"$f":"(S106/Instructions!$C$25)*100","v":0},{"$f":"(V106/Instructions!$C$26)*100","v":0},{"$f":"(Y106/Instructions!$C$27)*100","v":0},{"$f":"(AB106/Instructions!$C$28)*100","v":0},{"$f":"(AF106/Instructions!$C$29)*100","v":0},{"$f":"(AJ106/Instructions!$C$30)*100","v":0},{"$f":"(AN106/Instructions!$C$31)*100","v":0},0,{"$f":"(AS106/Instructions!$C$33)*100","v":{"$error":"#VALUE!"}},"----","E","E","E","E","E","E","E","E","E","E","--","E",null,null,null,null,{"$f":"Table_2[[#This Row],[Column51]]&Table_2[[#This Row],[Column52]]&BU108","v":""}]
[105,null,null,null,null,null,null,null,null,null,null,null,0,null,null,0,null,null,0,null,null,0,null,null,0,null,null,0,null,null,null,0,null,null,null,{"$f":"IF(AG107<Instructions!D136,AG107,SUM(AG107:AI107))","v":0},null,null,null,{"$f":"IF(AK107<Instructions!D135,AK107,SUM(AK107:AM107))","v":0},null,null,null,{"$f":"IF(AO107<Instructions!D134,AO107,SUM(AO107:AQ107))","v":0},"--",0,{"$f":"SUM(Table_2[[#This Row],[Column20]],Table_2[[#This Row],[Column19]],Table_2[[#This Row],[Column18]])","v":0},"HEALTH & PHY. EDU.",{"$f":"(M107/Instructions!$C$23)*100","v":0},{"$f":"(P107/Instructions!$C$24)*100","v":0},{"$f":"(S107/Instructions!$C$25)*100","v":0},{"$f":"(V107/Instructions!$C$26)*100","v":0},{"$f":"(Y107/Instructions!$C$27)*100","v":0},{"$f":"(AB107/Instructions!$C$28)*100","v":0},{"$f":"(AF107/Instructions!$C$29)*100","v":0},{"$f":"(AJ107/Instructions!$C$30)*100","v":0},{"$f":"(AN107/Instructions!$C$31)*100","v":0},0,{"$f":"(AS107/Instructions!$C$33)*100","v":{"$error":"#VALUE!"}},"----","E","E","E","E","E","E","E","E","E","E","--","E",null,null,null,null,{"$f":"Table_2[[#This Row],[Column51]]&Table_2[[#This Row],[Column52]]&BU109","v":""}]
[106,null,null,null,null,null,null,null,null,null,null,null,0,null,null,0,null,null,0,null,null,0,null,null,0,null,null,0,null,null,null,0,null,null,null,{"$f":"IF(AG108<Instructions!D137,AG108,SUM(AG108:AI108))","v":0},null,null,null,{"$f":"IF(AK108<Instructions!D136,AK108,SUM(AK108:AM108))","v":0},null,null,null,{"$f":"IF(AO108<Instructions!D135,AO108,SUM(AO108:AQ108))","v":0},"--",0,{"$f":"SUM(Table_2[[#This Row],[Column20]],Table_2[[#This Row],[Column19]],Table_2[[#This Row],[Column18]])","v":0},"HEALTH & PHY. EDU.",{"$f":"(M108/Instructions!$C$23)*100","v":0},{"$f":"(P108/Instructions!$C$24)*100","v":0},{"$f":"(S108/Instructions!$C$25)*100","v":0},{"$f":"(V108/Instructions!$C$26)*100","v":0},{"$f":"(Y108/Instructions!$C$27)*100","v":0},{"$f":"(AB108/Instructions!$C$28)*100","v":0},{"$f":"(AF108/Instructions!$C$29)*100","v":0},{"$f":"(AJ108/Instructions!$C$30)*100","v":0},{"$f":"(AN108/Instructions!$C$31)*100","v":0},0,{"$f":"(AS108/Instructions!$C$33)*100","v":{"$error":"#VALUE!"}},"----","E","E","E","E","E","E","E","E","E","E","--","E",null,null,null,null,{"$f":"Table_2[[#This Row],[Column51]]&Table_2[[#This Row],[Column52]]&BU110","v":""}]
[107,null,null,null,null,null,null,null,null,null,null,null,0,null,null,0,null,null,0,null,null,0,null,null,0,null,null,0,null,null,null,0,null,null,null,{"$f":"IF(AG109<Instructions!D138,AG109,SUM(AG109:AI109))","v":0},null,null,null,{"$f":"IF(AK109<Instructions!D137,AK109,SUM(AK109:AM109))","v":0},null,null,null,{"$f":"IF(AO109<Instructions!D136,AO109,SUM(AO109:AQ109))","v":0},"--",0,{"$f":"SUM(Table_2[[#This Row],[Column20]],Table_2[[#This Row],[Column19]],Table_2[[#This Row],[Column18]])","v":0},"HEALTH & PHY. EDU.",{"$f":"(M109/Instructions!$C$23)*100","v":0},{"$f":"(P109/Instructions!$C$24)*100","v":0},{"$f":"(S109/Instructions!$C$25)*100","v":0},{"$f":"(V109/Instructions!$C$26)*100","v":0},{"$f":"(Y109/Instructions!$C$27)*100","v":0},{"$f":"(AB109/Instructions!$C$28)*100","v":0},{"$f":"(AF109/Instructions!$C$29)*100","v":0},{"$f":"(AJ109/Instructions!$C$30)*100","v":0},{"$f":"(AN109/Instructions!$C$31)*100","v":0},0,{"$f":"(AS109/Instructions!$C$33)*100","v":{"$error":"#VALUE!"}},"----","E","E","E","E","E","E","E","E","E","E","--","E",null,null,null,null,{"$f":"Table_2[[#This Row],[Column51]]&Table_2[[#This Row],[Column52]]&BU111","v":""}]
[108,null,null,null,null,null,null,null,null,null,null,null,0,null,null,0,null,null,0,null,null,0,null,null,0,null,null,0,null,null,null,0,null,null,null,{"$f":"IF(AG110<Instructions!D139,AG110,SUM(AG110:AI110))","v":0},null,null,null,{"$f":"IF(AK110<Instructions!D138,AK110,SUM(AK110:AM110))","v":0},null,null,null,{"$f":"IF(AO110<Instructions!D137,AO110,SUM(AO110:AQ110))","v":0},"--",0,{"$f":"SUM(Table_2[[#This Row],[Column20]],Table_2[[#This Row],[Column19]],Table_2[[#This Row],[Column18]])","v":0},"HEALTH & PHY. EDU.",{"$f":"(M110/Instructions!$C$23)*100","v":0},{"$f":"(P110/Instructions!$C$24)*100","v":0},{"$f":"(S110/Instructions!$C$25)*100","v":0},{"$f":"(V110/Instructions!$C$26)*100","v":0},{"$f":"(Y110/Instructions!$C$27)*100","v":0},{"$f":"(AB110/Instructions!$C$28)*100","v":0},{"$f":"(AF110/Instructions!$C$29)*100","v":0},{"$f":"(AJ110/Instructions!$C$30)*100","v":0},{"$f":"(AN110/Instructions!$C$31)*100","v":0},0,{"$f":"(AS110/Instructions!$C$33)*100","v":{"$error":"#VALUE!"}},"----","E","E","E","E","E","E","E","E","E","E","--","E",null,null,null,null,{"$f":"Table_2[[#This Row],[Column51]]&Table_2[[#This Row],[Column52]]&BU112","v":""}]
[109,null,null,null,null,null,null,null,null,null,null,null,0,null,null,0,null,null,0,null,null,0,null,null,0,null,null,0,null,null,null,0,null,null,null,{"$f":"IF(AG111<Instructions!D140,AG111,SUM(AG111:AI111))","v":0},null,null,null,{"$f":"IF(AK111<Instructions!D139,AK111,SUM(AK111:AM111))","v":0},null,null,null,{"$f":"IF(AO111<Instructions!D138,AO111,SUM(AO111:AQ111))","v":0},"--",0,{"$f":"SUM(Table_2[[#This Row],[Column20]],Table_2[[#This Row],[Column19]],Table_2[[#This Row],[Column18]])","v":0},"HEALTH & PHY. EDU.",{"$f":"(M111/Instructions!$C$23)*100","v":0},{"$f":"(P111/Instructions!$C$24)*100","v":0},{"$f":"(S111/Instructions!$C$25)*100","v":0},{"$f":"(V111/Instructions!$C$26)*100","v":0},{"$f":"(Y111/Instructions!$C$27)*100","v":0},{"$f":"(AB111/Instructions!$C$28)*100","v":0},{"$f":"(AF111/Instructions!$C$29)*100","v":0},{"$f":"(AJ111/Instructions!$C$30)*100","v":0},{"$f":"(AN111/Instructions!$C$31)*100","v":0},0,{"$f":"(AS111/Instructions!$C$33)*100","v":{"$error":"#VALUE!"}},"----","E","E","E","E","E","E","E","E","E","E","--","E",null,null,null,null,{"$f":"Table_2[[#This Row],[Column51]]&Table_2[[#This Row],[Column52]]&BU113","v":""}]
[110,null,null,null,null,null,null,null,null,null,null,null,0,null,null,0,null,null,0,null,null,0,null,null,0,null,null,0,null,null,null,0,null,null,null,{"$f":"IF(AG112<Instructions!D141,AG112,SUM(AG112:AI112))","v":0},null,null,null,{"$f":"IF(AK112<Instructions!D140,AK112,SUM(AK112:AM112))","v":0},null,null,null,{"$f":"IF(AO112<Instructions!D139,AO112,SUM(AO112:AQ112))","v":0},"--",0,{"$f":"SUM(Table_2[[#This Row],[Column20]],Table_2[[#This Row],[Column19]],Table_2[[#This Row],[Column18]])","v":0},"HEALTH & PHY. EDU.",{"$f":"(M112/Instructions!$C$23)*100","v":0},{"$f":"(P112/Instructions!$C$24)*100","v":0},{"$f":"(S112/Instructions!$C$25)*100","v":0},{"$f":"(V112/Instructions!$C$26)*100","v":0},{"$f":"(Y112/Instructions!$C$27)*100","v":0},{"$f":"(AB112/Instructions!$C$28)*100","v":0},{"$f":"(AF112/Instructions!$C$29)*100","v":0},{"$f":"(AJ112/Instructions!$C$30)*100","v":0},{"$f":"(AN112/Instructions!$C$31)*100","v":0},0,{"$f":"(AS112/Instructions!$C$33)*100","v":{"$error":"#VALUE!"}},"----","E","E","E","E","E","E","E","E","E","E","--","E",null,null,null,null,{"$f":"Table_2[[#This Row],[Column51]]&Table_2[[#This Row],[Column52]]&BU114","v":""}]
[111,null,null,null,null,null,null,null,null,null,null,null,0,null,null,0,null,null,0,null,null,0,null,null,0,null,null,0,null,null,null,0,null,null,null,{"$f":"IF(AG113<Instructions!D142,AG113,SUM(AG113:AI113))","v":0},null,null,null,{"$f":"IF(AK113<Instructions!D141,AK113,SUM(AK113:AM113))","v":0},null,null,null,{"$f":"IF(AO113<Instructions!D140,AO113,SUM(AO113:AQ113))","v":0},"--",0,{"$f":"SUM(Table_2[[#This Row],[Column20]],Table_2[[#This Row],[Column19]],Table_2[[#This Row],[Column18]])","v":0},"HEALTH & PHY. EDU.",{"$f":"(M113/Instructions!$C$23)*100","v":0},{"$f":"(P113/Instructions!$C$24)*100","v":0},{"$f":"(S113/Instructions!$C$25)*100","v":0},{"$f":"(V113/Instructions!$C$26)*100","v":0},{"$f":"(Y113/Instructions!$C$27)*100","v":0},{"$f":"(AB113/Instructions!$C$28)*100","v":0},{"$f":"(AF113/Instructions!$C$29)*100","v":0},{"$f":"(AJ113/Instructions!$C$30)*100","v":0},{"$f":"(AN113/Instructions!$C$31)*100","v":0},0,{"$f":"(AS113/Instructions!$C$33)*100","v":{"$error":"#VALUE!"}},"----","E","E","E","E","E","E","E","E","E","E","--","E",null,null,null,null,{"$f":"Table_2[[#This Row],[Column51]]&Table_2[[#This Row],[Column52]]&BU115","v":""}]
[112,null,null,null,null,null,null,null,null,null,null,null,0,null,null,0,null,null,0,null,null,0,null,null,0,null,null,0,null,null,null,0,null,null,null,{"$f":"IF(AG114<Instructions!D143,AG114,SUM(AG114:AI114))","v":0},null,null,null,{"$f":"IF(AK114<Instructions!D142,AK114,SUM(AK114:AM114))","v":0},null,null,null,{"$f":"IF(AO114<Instructions!D141,AO114,SUM(AO114:AQ114))","v":0},"--",0,{"$f":"SUM(Table_2[[#This Row],[Column20]],Table_2[[#This Row],[Column19]],Table_2[[#This Row],[Column18]])","v":0},"HEALTH & PHY. EDU.",{"$f":"(M114/Instructions!$C$23)*100","v":0},{"$f":"(P114/Instructions!$C$24)*100","v":0},{"$f":"(S114/Instructions!$C$25)*100","v":0},{"$f":"(V114/Instructions!$C$26)*100","v":0},{"$f":"(Y114/Instructions!$C$27)*100","v":0},{"$f":"(AB114/Instructions!$C$28)*100","v":0},{"$f":"(AF114/Instructions!$C$29)*100","v":0},{"$f":"(AJ114/Instructions!$C$30)*100","v":0},{"$f":"(AN114/Instructions!$C$31)*100","v":0},0,{"$f":"(AS114/Instructions!$C$33)*100","v":{"$error":"#VALUE!"}},"----","E","E","E","E","E","E","E","E","E","E","--","E",null,null,null,null,{"$f":"Table_2[[#This Row],[Column51]]&Table_2[[#This Row],[Column52]]&BU116","v":""}]
[113,null,null,null,null,null,null,null,null,null,null,null,0,null,null,0,null,null,0,null,null,0,null,null,0,null,null,0,null,null,null,0,null,null,null,{"$f":"IF(AG115<Instructions!D144,AG115,SUM(AG115:AI115))","v":0},null,null,null,{"$f":"IF(AK115<Instructions!D143,AK115,SUM(AK115:AM115))","v":0},null,null,null,{"$f":"IF(AO115<Instructions!D142,AO115,SUM(AO115:AQ115))","v":0},"--",0,{"$f":"SUM(Table_2[[#This Row],[Column20]],Table_2[[#This Row],[Column19]],Table_2[[#This Row],[Column18]])","v":0},"HEALTH & PHY. EDU.",{"$f":"(M115/Instructions!$C$23)*100","v":0},{"$f":"(P115/Instructions!$C$24)*100","v":0},{"$f":"(S115/Instructions!$C$25)*100","v":0},{"$f":"(V115/Instructions!$C$26)*100","v":0},{"$f":"(Y115/Instructions!$C$27)*100","v":0},{"$f":"(AB115/Instructions!$C$28)*100","v":0},{"$f":"(AF115/Instructions!$C$29)*100","v":0},{"$f":"(AJ115/Instructions!$C$30)*100","v":0},{"$f":"(AN115/Instructions!$C$31)*100","v":0},0,{"$f":"(AS115/Instructions!$C$33)*100","v":{"$error":"#VALUE!"}},"----","E","E","E","E","E","E","E","E","E","E","--","E",null,null,null,null,{"$f":"Table_2[[#This Row],[Column51]]&Table_2[[#This Row],[Column52]]&BU117","v":""}]
[114,null,null,null,null,null,null,null,null,null,null,null,0,null,null,0,null,null,0,null,null,0,null,null,0,null,null,0,null,null,null,0,null,null,null,{"$f":"IF(AG116<Instructions!D145,AG116,SUM(AG116:AI116))","v":0},null,null,null,{"$f":"IF(AK116<Instructions!D144,AK116,SUM(AK116:AM116))","v":0},null,null,null,{"$f":"IF(AO116<Instructions!D143,AO116,SUM(AO116:AQ116))","v":0},"--",0,{"$f":"SUM(Table_2[[#This Row],[Column20]],Table_2[[#This Row],[Column19]],Table_2[[#This Row],[Column18]])","v":0},"HEALTH & PHY. EDU.",{"$f":"(M116/Instructions!$C$23)*100","v":0},{"$f":"(P116/Instructions!$C$24)*100","v":0},{"$f":"(S116/Instructions!$C$25)*100","v":0},{"$f":"(V116/Instructions!$C$26)*100","v":0},{"$f":"(Y116/Instructions!$C$27)*100","v":0},{"$f":"(AB116/Instructions!$C$28)*100","v":0},{"$f":"(AF116/Instructions!$C$29)*100","v":0},{"$f":"(AJ116/Instructions!$C$30)*100","v":0},{"$f":"(AN116/Instructions!$C$31)*100","v":0},0,{"$f":"(AS116/Instructions!$C$33)*100","v":{"$error":"#VALUE!"}},"----","E","E","E","E","E","E","E","E","E","E","--","E",null,null,null,null,{"$f":"Table_2[[#This Row],[Column51]]&Table_2[[#This Row],[Column52]]&BU118","v":""}]
[115,null,null,null,null,null,null,null,null,null,null,null,0,null,null,0,null,null,0,null,null,0,null,null,0,null,null,0,null,null,null,0,null,null,null,{"$f":"IF(AG117<Instructions!D146,AG117,SUM(AG117:AI117))","v":0},null,null,null,{"$f":"IF(AK117<Instructions!D145,AK117,SUM(AK117:AM117))","v":0},null,null,null,{"$f":"IF(AO117<Instructions!D144,AO117,SUM(AO117:AQ117))","v":0},"--",0,{"$f":"SUM(Table_2[[#This Row],[Column20]],Table_2[[#This Row],[Column19]],Table_2[[#This Row],[Column18]])","v":0},"HEALTH & PHY. EDU.",{"$f":"(M117/Instructions!$C$23)*100","v":0},{"$f":"(P117/Instructions!$C$24)*100","v":0},{"$f":"(S117/Instructions!$C$25)*100","v":0},{"$f":"(V117/Instructions!$C$26)*100","v":0},{"$f":"(Y117/Instructions!$C$27)*100","v":0},{"$f":"(AB117/Instructions!$C$28)*100","v":0},{"$f":"(AF117/Instructions!$C$29)*100","v":0},{"$f":"(AJ117/Instructions!$C$30)*100","v":0},{"$f":"(AN117/Instructions!$C$31)*100","v":0},0,{"$f":"(AS117/Instructions!$C$33)*100","v":{"$error":"#VALUE!"}},"----","E","E",{"$f":"IFERROR(IF(AY117>90,\"A+\",IF(AY117>80,\"A\",IF(AY117>70,\"B+\",IF(AY117>60,\"B\",IF(AY117>50,\"C+\",IF(AY117>40,\"C\",IF(AY117>=33,\"D\",\"E\"))))))),\"Abs\")","v":"E"},{"$f":"IFERROR(IF(AZ117>90,\"A+\",IF(AZ117>80,\"A\",IF(AZ117>70,\"B+\",IF(AZ117>60,\"B\",IF(AZ117>50,\"C+\",IF(AZ117>40,\"C\",IF(AZ117>=33,\"D\",\"E\"))))))),\"Abs\")","v":"E"},{"$f":"IFERROR(IF(BA117>90,\"A+\",IF(BA117>80,\"A\",IF(BA117>70,\"B+\",IF(BA117>60,\"B\",IF(BA117>50,\"C+\",IF(BA117>40,\"C\",IF(BA117>=33,\"D\",\"E\"))))))),\"Abs\")","v":"E"},{"$f":"IFERROR(IF(BB117>90,\"A+\",IF(BB117>80,\"A\",IF(BB117>70,\"B+\",IF(BB117>60,\"B\",IF(BB117>50,\"C+\",IF(BB117>40,\"C\",IF(BB117>=33,\"D\",\"E\"))))))),\"Abs\")","v":"E"},{"$f":"IFERROR(IF(BC117>90,\"A+\",IF(BC117>80,\"A\",IF(BC117>70,\"B+\",IF(BC117>60,\"B\",IF(BC117>50,\"C+\",IF(BC117>40,\"C\",IF(BC117>=33,\"D\",\"E\"))))))),\"Abs\")","v":"E"},{"$f":"IFERROR(IF(BD117>90,\"A+\",IF(BD117>80,\"A\",IF(BD117>70,\"B+\",IF(BD117>60,\"B\",IF(BD117>50,\"C+\",IF(BD117>40,\"C\",IF(BD117>=33,\"D\",\"E\"))))))),\"Abs\")","v":"E"},{"$f":"IFERROR(IF(BE117>90,\"A+\",IF(BE117>80,\"A\",IF(BE117>70,\"B+\",IF(BE117>60,\"B\",IF(BE117>50,\"C+\",IF(BE117>40,\"C\",IF(BE117>=33,\"D\",\"E\"))))))),\"Abs\")","v":"E"},{"$f":"IFERROR(IF(BF117>90,\"A+\",IF(BF117>80,\"A\",IF(BF117>70,\"B+\",IF(BF117>60,\"B\",IF(BF117>50,\"C+\",IF(BF117>40,\"C\",IF(BF117>=33,\"D\",\"E\"))))))),\"Abs\")","v":"E"},"--","E",null,null,null,null,{"$f":"Table_2[[#This Row],[Column51]]&Table_2[[#This Row],[Column52]]&BU119","v":""}]
[116,null,null,null,null,null,null,null,null,null,null,null,0,null,null,0,null,null,0,null,null,0,null,null,0,null,null,0,null,null,null,0,null,null,null,{"$f":"IF(AG118<Instructions!D147,AG118,SUM(AG118:AI118))","v":0},null,null,null,{"$f":"IF(AK118<Instructions!D146,AK118,SUM(AK118:AM118))","v":0},null,null,null,{"$f":"IF(AO118<Instructions!D145,AO118,SUM(AO118:AQ118))","v":0},"--",0,{"$f":"SUM(Table_2[[#This Row],[Column20]],Table_2[[#This Row],[Column19]],Table_2[[#This Row],[Column18]])","v":0},"HEALTH & PHY. EDU.",{"$f":"(M118/Instructions!$C$23)*100","v":0},{"$f":"(P118/Instructions!$C$24)*100","v":0},{"$f":"(S118/Instructions!$C$25)*100","v":0},{"$f":"(V118/Instructions!$C$26)*100","v":0},{"$f":"(Y118/Instructions!$C$27)*100","v":0},{"$f":"(AB118/Instructions!$C$28)*100","v":0},{"$f":"(AF118/Instructions!$C$29)*100","v":0},{"$f":"(AJ118/Instructions!$C$30)*100","v":0},{"$f":"(AN118/Instructions!$C$31)*100","v":0},0,{"$f":"(AS118/Instructions!$C$33)*100","v":{"$error":"#VALUE!"}},"----","E","E","E","E","E","E","E","E","E","E","--","E",null,null,null,null,{"$f":"Table_2[[#This Row],[Column51]]&Table_2[[#This Row],[Column52]]&BU120","v":""}]
[117,null,null,null,null,null,null,null,null,null,null,null,0,null,null,0,null,null,0,null,null,0,null,null,0,null,null,0,null,null,null,0,null,null,null,{"$f":"IF(AG119<Instructions!D148,AG119,SUM(AG119:AI119))","v":0},null,null,null,{"$f":"IF(AK119<Instructions!D147,AK119,SUM(AK119:AM119))","v":0},null,null,null,{"$f":"IF(AO119<Instructions!D146,AO119,SUM(AO119:AQ119))","v":0},"--",0,{"$f":"SUM(Table_2[[#This Row],[Column20]],Table_2[[#This Row],[Column19]],Table_2[[#This Row],[Column18]])","v":0},"HEALTH & PHY. EDU.",{"$f":"(M119/Instructions!$C$23)*100","v":0},{"$f":"(P119/Instructions!$C$24)*100","v":0},{"$f":"(S119/Instructions!$C$25)*100","v":0},{"$f":"(V119/Instructions!$C$26)*100","v":0},{"$f":"(Y119/Instructions!$C$27)*100","v":0},{"$f":"(AB119/Instructions!$C$28)*100","v":0},{"$f":"(AF119/Instructions!$C$29)*100","v":0},{"$f":"(AJ119/Instructions!$C$30)*100","v":0},{"$f":"(AN119/Instructions!$C$31)*100","v":0},0,{"$f":"(AS119/Instructions!$C$33)*100","v":{"$error":"#VALUE!"}},"----","E","E","E","E","E","E","E","E","E","E","--","E",null,null,null,null,{"$f":"Table_2[[#This Row],[Column51]]&Table_2[[#This Row],[Column52]]&BU121","v":""}]
[118,null,null,null,null,null,null,null,null,null,null,null,0,null,null,0,null,null,0,null,null,0,null,null,0,null,null,0,null,null,null,0,null,null,null,{"$f":"IF(AG120<Instructions!D149,AG120,SUM(AG120:AI120))","v":0},null,null,null,{"$f":"IF(AK120<Instructions!D148,AK120,SUM(AK120:AM120))","v":0},null,null,null,{"$f":"IF(AO120<Instructions!D147,AO120,SUM(AO120:AQ120))","v":0},"--",0,{"$f":"SUM(Table_2[[#This Row],[Column20]],Table_2[[#This Row],[Column19]],Table_2[[#This Row],[Column18]])","v":0},"HEALTH & PHY. EDU.",{"$f":"(M120/Instructions!$C$23)*100","v":0},{"$f":"(P120/Instructions!$C$24)*100","v":0},{"$f":"(S120/Instructions!$C$25)*100","v":0},{"$f":"(V120/Instructions!$C$26)*100","v":0},{"$f":"(Y120/Instructions!$C$27)*100","v":0},{"$f":"(AB120/Instructions!$C$28)*100","v":0},{"$f":"(AF120/Instructions!$C$29)*100","v":0},{"$f":"(AJ120/Instructions!$C$30)*100","v":0},{"$f":"(AN120/Instructions!$C$31)*100","v":0},0,{"$f":"(AS120/Instructions!$C$33)*100","v":{"$error":"#VALUE!"}},"----","E","E","E","E","E","E","E","E","E","E","--","E",null,null,null,null,{"$f":"Table_2[[#This Row],[Column51]]&Table_2[[#This Row],[Column52]]&BU122","v":""}]
[119,null,null,null,null,null,null,null,null,null,null,null,0,null,null,0,null,null,0,null,null,0,null,null,0,null,null,0,null,null,null,0,null,null,null,{"$f":"IF(AG121<Instructions!D150,AG121,SUM(AG121:AI121))","v":0},null,null,null,{"$f":"IF(AK121<Instructions!D149,AK121,SUM(AK121:AM121))","v":0},null,null,null,{"$f":"IF(AO121<Instructions!D148,AO121,SUM(AO121:AQ121))","v":0},"--",0,{"$f":"SUM(Table_2[[#This Row],[Column20]],Table_2[[#This Row],[Column19]],Table_2[[#This Row],[Column18]])","v":0},"HEALTH & PHY. EDU.",{"$f":"(M121/Instructions!$C$23)*100","v":0},{"$f":"(P121/Instructions!$C$24)*100","v":0},{"$f":"(S121/Instructions!$C$25)*100","v":0},{"$f":"(V121/Instructions!$C$26)*100","v":0},{"$f":"(Y121/Instructions!$C$27)*100","v":0},{"$f":"(AB121/Instructions!$C$28)*100","v":0},{"$f":"(AF121/Instructions!$C$29)*100","v":0},{"$f":"(AJ121/Instructions!$C$30)*100","v":0},{"$f":"(AN121/Instructions!$C$31)*100","v":0},0,{"$f":"(AS121/Instructions!$C$33)*100","v":{"$error":"#VALUE!"}},"----","E","E","E","E","E","E","E","E","E","E","--","E",null,null,null,null,{"$f":"Table_2[[#This Row],[Column51]]&Table_2[[#This Row],[Column52]]&BU123","v":""}]
[120,null,null,null,null,null,null,null,null,null,null,null,0,null,null,0,null,null,0,null,null,0,null,null,0,null,null,0,null,null,null,0,null,null,null,{"$f":"IF(AG122<Instructions!D151,AG122,SUM(AG122:AI122))","v":0},null,null,null,{"$f":"IF(AK122<Instructions!D150,AK122,SUM(AK122:AM122))","v":0},null,null,null,{"$f":"IF(AO122<Instructions!D149,AO122,SUM(AO122:AQ122))","v":0},"--",0,{"$f":"SUM(Table_2[[#This Row],[Column20]],Table_2[[#This Row],[Column19]],Table_2[[#This Row],[Column18]])","v":0},"HEALTH & PHY. EDU.",{"$f":"(M122/Instructions!$C$23)*100","v":0},{"$f":"(P122/Instructions!$C$24)*100","v":0},{"$f":"(S122/Instructions!$C$25)*100","v":0},{"$f":"(V122/Instructions!$C$26)*100","v":0},{"$f":"(Y122/Instructions!$C$27)*100","v":0},{"$f":"(AB122/Instructions!$C$28)*100","v":0},{"$f":"(AF122/Instructions!$C$29)*100","v":0},{"$f":"(AJ122/Instructions!$C$30)*100","v":0},{"$f":"(AN122/Instructions!$C$31)*100","v":0},0,{"$f":"(AS122/Instructions!$C$33)*100","v":{"$error":"#VALUE!"}},"----","E","E","E","E","E","E","E","E","E","E","--","E",null,null,null,null,{"$f":"Table_2[[#This Row],[Column51]]&Table_2[[#This Row],[Column52]]&BU124","v":""}]
[121,null,null,null,null,null,null,null,null,null,null,null,0,null,null,0,null,null,0,null,null,0,null,null,0,null,null,0,null,null,null,0,null,null,null,{"$f":"IF(AG123<Instructions!D152,AG123,SUM(AG123:AI123))","v":0},null,null,null,{"$f":"IF(AK123<Instructions!D151,AK123,SUM(AK123:AM123))","v":0},null,null,null,{"$f":"IF(AO123<Instructions!D150,AO123,SUM(AO123:AQ123))","v":0},"--",0,{"$f":"SUM(Table_2[[#This Row],[Column20]],Table_2[[#This Row],[Column19]],Table_2[[#This Row],[Column18]])","v":0},"HEALTH & PHY. EDU.",{"$f":"(M123/Instructions!$C$23)*100","v":0},{"$f":"(P123/Instructions!$C$24)*100","v":0},{"$f":"(S123/Instructions!$C$25)*100","v":0},{"$f":"(V123/Instructions!$C$26)*100","v":0},{"$f":"(Y123/Instructions!$C$27)*100","v":0},{"$f":"(AB123/Instructions!$C$28)*100","v":0},{"$f":"(AF123/Instructions!$C$29)*100","v":0},{"$f":"(AJ123/Instructions!$C$30)*100","v":0},{"$f":"(AN123/Instructions!$C$31)*100","v":0},0,{"$f":"(AS123/Instructions!$C$33)*100","v":{"$error":"#VALUE!"}},"----","E","E","E","E","E","E","E","E","E","E","--","E",null,null,null,null,{"$f":"Table_2[[#This Row],[Column51]]&Table_2[[#This Row],[Column52]]&BU125","v":""}]
[122,null,null,null,null,null,null,null,null,null,null,null,0,null,null,0,null,null,0,null,null,0,null,null,0,null,null,0,null,null,null,0,null,null,null,{"$f":"IF(AG124<Instructions!D153,AG124,SUM(AG124:AI124))","v":0},null,null,null,{"$f":"IF(AK124<Instructions!D152,AK124,SUM(AK124:AM124))","v":0},null,null,null,{"$f":"IF(AO124<Instructions!D151,AO124,SUM(AO124:AQ124))","v":0},"--",0,{"$f":"SUM(Table_2[[#This Row],[Column20]],Table_2[[#This Row],[Column19]],Table_2[[#This Row],[Column18]])","v":0},"HEALTH & PHY. EDU.",{"$f":"(M124/Instructions!$C$23)*100","v":0},{"$f":"(P124/Instructions!$C$24)*100","v":0},{"$f":"(S124/Instructions!$C$25)*100","v":0},{"$f":"(V124/Instructions!$C$26)*100","v":0},{"$f":"(Y124/Instructions!$C$27)*100","v":0},{"$f":"(AB124/Instructions!$C$28)*100","v":0},{"$f":"(AF124/Instructions!$C$29)*100","v":0},{"$f":"(AJ124/Instructions!$C$30)*100","v":0},{"$f":"(AN124/Instructions!$C$31)*100","v":0},0,{"$f":"(AS124/Instructions!$C$33)*100","v":{"$error":"#VALUE!"}},"----","E","E","E","E","E","E","E","E","E","E","--","E",null,null,null,null,{"$f":"Table_2[[#This Row],[Column51]]&Table_2[[#This Row],[Column52]]&BU126","v":""}]
[123,null,null,null,null,null,null,null,null,null,null,null,0,null,null,0,null,null,0,null,null,0,null,null,0,null,null,0,null,null,null,0,null,null,null,{"$f":"IF(AG125<Instructions!D154,AG125,SUM(AG125:AI125))","v":0},null,null,null,{"$f":"IF(AK125<Instructions!D153,AK125,SUM(AK125:AM125))","v":0},null,null,null,{"$f":"IF(AO125<Instructions!D152,AO125,SUM(AO125:AQ125))","v":0},"--",0,{"$f":"SUM(Table_2[[#This Row],[Column20]],Table_2[[#This Row],[Column19]],Table_2[[#This Row],[Column18]])","v":0},"HEALTH & PHY. EDU.",{"$f":"(M125/Instructions!$C$23)*100","v":0},{"$f":"(P125/Instructions!$C$24)*100","v":0},{"$f":"(S125/Instructions!$C$25)*100","v":0},{"$f":"(V125/Instructions!$C$26)*100","v":0},{"$f":"(Y125/Instructions!$C$27)*100","v":0},{"$f":"(AB125/Instructions!$C$28)*100","v":0},{"$f":"(AF125/Instructions!$C$29)*100","v":0},{"$f":"(AJ125/Instructions!$C$30)*100","v":0},{"$f":"(AN125/Instructions!$C$31)*100","v":0},0,{"$f":"(AS125/Instructions!$C$33)*100","v":{"$error":"#VALUE!"}},"----","E","E","E","E","E","E","E","E","E","E","--","E",null,null,null,null,{"$f":"Table_2[[#This Row],[Column51]]&Table_2[[#This Row],[Column52]]&BU127","v":""}]
[124,null,null,null,null,null,null,null,null,null,null,null,0,null,null,0,null,null,0,null,null,0,null,null,0,null,null,0,null,null,null,0,null,null,null,{"$f":"IF(AG126<Instructions!D155,AG126,SUM(AG126:AI126))","v":0},null,null,null,{"$f":"IF(AK126<Instructions!D154,AK126,SUM(AK126:AM126))","v":0},null,null,null,{"$f":"IF(AO126<Instructions!D153,AO126,SUM(AO126:AQ126))","v":0},"--",0,{"$f":"SUM(Table_2[[#This Row],[Column20]],Table_2[[#This Row],[Column19]],Table_2[[#This Row],[Column18]])","v":0},"HEALTH & PHY. EDU.",{"$f":"(M126/Instructions!$C$23)*100","v":0},{"$f":"(P126/Instructions!$C$24)*100","v":0},{"$f":"(S126/Instructions!$C$25)*100","v":0},{"$f":"(V126/Instructions!$C$26)*100","v":0},{"$f":"(Y126/Instructions!$C$27)*100","v":0},{"$f":"(AB126/Instructions!$C$28)*100","v":0},{"$f":"(AF126/Instructions!$C$29)*100","v":0},{"$f":"(AJ126/Instructions!$C$30)*100","v":0},{"$f":"(AN126/Instructions!$C$31)*100","v":0},0,{"$f":"(AS126/Instructions!$C$33)*100","v":{"$error":"#VALUE!"}},"----","E","E","E","E","E","E","E","E","E","E","--","E",null,null,null,null,{"$f":"Table_2[[#This Row],[Column51]]&Table_2[[#This Row],[Column52]]&BU128","v":""}]
[125,null,null,null,null,null,null,null,null,null,null,null,0,null,null,0,null,null,0,null,null,0,null,null,0,null,null,0,null,null,null,0,null,null,null,{"$f":"IF(AG127<Instructions!D156,AG127,SUM(AG127:AI127))","v":0},null,null,null,{"$f":"IF(AK127<Instructions!D155,AK127,SUM(AK127:AM127))","v":0},null,null,null,{"$f":"IF(AO127<Instructions!D154,AO127,SUM(AO127:AQ127))","v":0},"--",0,{"$f":"SUM(Table_2[[#This Row],[Column20]],Table_2[[#This Row],[Column19]],Table_2[[#This Row],[Column18]])","v":0},"HEALTH & PHY. EDU.",{"$f":"(M127/Instructions!$C$23)*100","v":0},{"$f":"(P127/Instructions!$C$24)*100","v":0},{"$f":"(S127/Instructions!$C$25)*100","v":0},{"$f":"(V127/Instructions!$C$26)*100","v":0},{"$f":"(Y127/Instructions!$C$27)*100","v":0},{"$f":"(AB127/Instructions!$C$28)*100","v":0},{"$f":"(AF127/Instructions!$C$29)*100","v":0},{"$f":"(AJ127/Instructions!$C$30)*100","v":0},{"$f":"(AN127/Instructions!$C$31)*100","v":0},0,{"$f":"(AS127/Instructions!$C$33)*100","v":{"$error":"#VALUE!"}},"----","E","E","E","E","E","E","E","E","E","E","--","E",null,null,null,null,{"$f":"Table_2[[#This Row],[Column51]]&Table_2[[#This Row],[Column52]]&BU129","v":""}]
[126,null,null,null,null,null,null,null,null,null,null,null,0,null,null,0,null,null,0,null,null,0,null,null,0,null,null,0,null,null,null,0,null,null,null,{"$f":"IF(AG128<Instructions!D157,AG128,SUM(AG128:AI128))","v":0},null,null,null,{"$f":"IF(AK128<Instructions!D156,AK128,SUM(AK128:AM128))","v":0},null,null,null,{"$f":"IF(AO128<Instructions!D155,AO128,SUM(AO128:AQ128))","v":0},"--",0,{"$f":"SUM(Table_2[[#This Row],[Column20]],Table_2[[#This Row],[Column19]],Table_2[[#This Row],[Column18]])","v":0},"HEALTH & PHY. EDU.",{"$f":"(M128/Instructions!$C$23)*100","v":0},{"$f":"(P128/Instructions!$C$24)*100","v":0},{"$f":"(S128/Instructions!$C$25)*100","v":0},{"$f":"(V128/Instructions!$C$26)*100","v":0},{"$f":"(Y128/Instructions!$C$27)*100","v":0},{"$f":"(AB128/Instructions!$C$28)*100","v":0},{"$f":"(AF128/Instructions!$C$29)*100","v":0},{"$f":"(AJ128/Instructions!$C$30)*100","v":0},{"$f":"(AN128/Instructions!$C$31)*100","v":0},0,{"$f":"(AS128/Instructions!$C$33)*100","v":{"$error":"#VALUE!"}},"----","E","E","E","E","E","E","E","E","E","E","--","E",null,null,null,null,{"$f":"Table_2[[#This Row],[Column51]]&Table_2[[#This Row],[Column52]]&BU130","v":""}]
[127,null,null,null,null,null,null,null,null,null,null,null,0,null,null,0,null,null,0,null,null,0,null,null,0,null,null,0,null,null,null,0,null,null,null,{"$f":"IF(AG129<Instructions!D158,AG129,SUM(AG129:AI129))","v":0},null,null,null,{"$f":"IF(AK129<Instructions!D157,AK129,SUM(AK129:AM129))","v":0},null,null,null,{"$f":"IF(AO129<Instructions!D156,AO129,SUM(AO129:AQ129))","v":0},"--",0,{"$f":"SUM(Table_2[[#This Row],[Column20]],Table_2[[#This Row],[Column19]],Table_2[[#This Row],[Column18]])","v":0},"HEALTH & PHY. EDU.",{"$f":"(M129/Instructions!$C$23)*100","v":0},{"$f":"(P129/Instructions!$C$24)*100","v":0},{"$f":"(S129/Instructions!$C$25)*100","v":0},{"$f":"(V129/Instructions!$C$26)*100","v":0},{"$f":"(Y129/Instructions!$C$27)*100","v":0},{"$f":"(AB129/Instructions!$C$28)*100","v":0},{"$f":"(AF129/Instructions!$C$29)*100","v":0},{"$f":"(AJ129/Instructions!$C$30)*100","v":0},{"$f":"(AN129/Instructions!$C$31)*100","v":0},0,{"$f":"(AS129/Instructions!$C$33)*100","v":{"$error":"#VALUE!"}},"----","E","E","E","E","E","E","E","E","E","E","--","E",null,null,null,null,{"$f":"Table_2[[#This Row],[Column51]]&Table_2[[#This Row],[Column52]]&BU131","v":""}]
[128,null,null,null,null,null,null,null,null,null,null,null,0,null,null,0,null,null,0,null,null,0,null,null,0,null,null,0,null,null,null,0,null,null,null,{"$f":"IF(AG130<Instructions!D159,AG130,SUM(AG130:AI130))","v":0},null,null,null,{"$f":"IF(AK130<Instructions!D158,AK130,SUM(AK130:AM130))","v":0},null,null,null,{"$f":"IF(AO130<Instructions!D157,AO130,SUM(AO130:AQ130))","v":0},"--",0,{"$f":"SUM(Table_2[[#This Row],[Column20]],Table_2[[#This Row],[Column19]],Table_2[[#This Row],[Column18]])","v":0},"HEALTH & PHY. EDU.",{"$f":"(M130/Instructions!$C$23)*100","v":0},{"$f":"(P130/Instructions!$C$24)*100","v":0},{"$f":"(S130/Instructions!$C$25)*100","v":0},{"$f":"(V130/Instructions!$C$26)*100","v":0},{"$f":"(Y130/Instructions!$C$27)*100","v":0},{"$f":"(AB130/Instructions!$C$28)*100","v":0},{"$f":"(AF130/Instructions!$C$29)*100","v":0},{"$f":"(AJ130/Instructions!$C$30)*100","v":0},{"$f":"(AN130/Instructions!$C$31)*100","v":0},0,{"$f":"(AS130/Instructions!$C$33)*100","v":{"$error":"#VALUE!"}},"----","E","E","E","E","E","E","E","E","E","E","--","E",null,null,null,null,{"$f":"Table_2[[#This Row],[Column51]]&Table_2[[#This Row],[Column52]]&BU132","v":""}]
[129,null,null,null,null,null,null,null,null,null,null,null,0,null,null,0,null,null,0,null,null,0,null,null,0,null,null,0,null,null,null,0,null,null,null,{"$f":"IF(AG131<Instructions!D160,AG131,SUM(AG131:AI131))","v":0},null,null,null,{"$f":"IF(AK131<Instructions!D159,AK131,SUM(AK131:AM131))","v":0},null,null,null,{"$f":"IF(AO131<Instructions!D158,AO131,SUM(AO131:AQ131))","v":0},"--",0,{"$f":"SUM(Table_2[[#This Row],[Column20]],Table_2[[#This Row],[Column19]],Table_2[[#This Row],[Column18]])","v":0},"HEALTH & PHY. EDU.",{"$f":"(M131/Instructions!$C$23)*100","v":0},{"$f":"(P131/Instructions!$C$24)*100","v":0},{"$f":"(S131/Instructions!$C$25)*100","v":0},{"$f":"(V131/Instructions!$C$26)*100","v":0},{"$f":"(Y131/Instructions!$C$27)*100","v":0},{"$f":"(AB131/Instructions!$C$28)*100","v":0},{"$f":"(AF131/Instructions!$C$29)*100","v":0},{"$f":"(AJ131/Instructions!$C$30)*100","v":0},{"$f":"(AN131/Instructions!$C$31)*100","v":0},0,{"$f":"(AS131/Instructions!$C$33)*100","v":{"$error":"#VALUE!"}},"----","E","E","E","E","E","E","E","E","E","E","--","E",null,null,null,null,{"$f":"Table_2[[#This Row],[Column51]]&Table_2[[#This Row],[Column52]]&BU133","v":""}]
[130,null,null,null,null,null,null,null,null,null,null,null,{"$f":"IF(K132<33,K132,SUM(K132:L132))","v":0},null,null,{"$f":"IF(N132<20,N132,SUM(N132:O132))","v":0},null,null,{"$f":"IF(Q132<20,Q132,SUM(Q132:R132))","v":0},null,null,{"$f":"IF(T132<20,T132,SUM(T132:U132))","v":0},null,null,{"$f":"IF(W132<20,W132,SUM(W132:X132))","v":0},null,null,{"$f":"IF(Z132<20,Z132,SUM(Z132:AA132))","v":0},null,null,null,{"$f":"IF(AC132<10,AC132,SUM(AC132:AE132))","v":0},null,null,null,{"$f":"IF(AG132<Instructions!D161,AG132,SUM(AG132:AI132))","v":0},null,null,null,{"$f":"IF(AK132<Instructions!D160,AK132,SUM(AK132:AM132))","v":0},null,null,null,{"$f":"IF(AO132<Instructions!D159,AO132,SUM(AO132:AQ132))","v":0},{"$f":"IF(MIN(M132,P132,S132,V132,Y132,AB132)>=33,SUM(M132,P132,S132,V132,Y132,AB132),\"--\")","v":"--"},{"$f":"IF(AS132=\"--\",0,AS132)","v":0},{"$f":"SUM(Table_2[[#This Row],[Column20]],Table_2[[#This Row],[Column19]],Table_2[[#This Row],[Column18]])","v":0},{"$f":"IF(N(AJ132)>0,$AG$1,IF(N(AN132)>0,$AK$1,$AO$1))","v":"HEALTH & PHY. EDU."},{"$f":"(M132/Instructions!$C$23)*100","v":0},{"$f":"(P132/Instructions!$C$24)*100","v":0},{"$f":"(S132/Instructions!$C$25)*100","v":0},{"$f":"(V132/Instructions!$C$26)*100","v":0},{"$f":"(Y132/Instructions!$C$27)*100","v":0},{"$f":"(AB132/Instructions!$C$28)*100","v":0},{"$f":"(AF132/Instructions!$C$29)*100","v":0},{"$f":"(AJ132/Instructions!$C$30)*100","v":0},{"$f":"(AN132/Instructions!$C$31)*100","v":0},{"$f":"(AR132/100)*100","v":0},{"$f":"(AS132/Instructions!$C$33)*100","v":{"$error":"#VALUE!"}},{"$f":"IF(AND(AW132>=33,AX132>=33,AY132>=33,AZ132>=33,BA132>=33,BB132>=33),\"PASS\",\"----\")","v":"----"},"E","E","E","E","E","E","E","E","E","E",{"$f":"IFERROR(IF(BG132>90,\"A+\",IF(BG132>80,\"A\",IF(BG132>70,\"B+\",IF(BG132>60,\"B\",IF(BG132>50,\"C+\",IF(BG132>40,\"C\",IF(BG132>=33,\"D\",\"E\"))))))),\"--\")","v":"--"},{"$f":"IFERROR(IF(BF132>90,\"A+\",IF(BF132>80,\"A\",IF(BF132>70,\"B+\",IF(BF132>60,\"B\",IF(BF132>50,\"C+\",IF(BF132>40,\"C\",IF(BF132>=33,\"D\",\"E\"))))))),\"Abs\")","v":"E"},null,null,null,null,{"$f":"Table_2[[#This Row],[Column51]]&Table_2[[#This Row],[Column52]]&BU134","v":""}]
[131,null,null,null,null,null,null,null,null,null,null,null,0,null,null,0,null,null,0,null,null,0,null,null,0,null,null,0,null,null,null,0,null,null,null,{"$f":"IF(AG133<Instructions!D162,AG133,SUM(AG133:AI133))","v":0},null,null,null,{"$f":"IF(AK133<Instructions!D161,AK133,SUM(AK133:AM133))","v":0},null,null,null,{"$f":"IF(AO133<Instructions!D160,AO133,SUM(AO133:AQ133))","v":0},"--",0,{"$f":"SUM(Table_2[[#This Row],[Column20]],Table_2[[#This Row],[Column19]],Table_2[[#This Row],[Column18]])","v":0},"HEALTH & PHY. EDU.",{"$f":"(M133/Instructions!$C$23)*100","v":0},{"$f":"(P133/Instructions!$C$24)*100","v":0},{"$f":"(S133/Instructions!$C$25)*100","v":0},{"$f":"(V133/Instructions!$C$26)*100","v":0},{"$f":"(Y133/Instructions!$C$27)*100","v":0},{"$f":"(AB133/Instructions!$C$28)*100","v":0},{"$f":"(AF133/Instructions!$C$29)*100","v":0},{"$f":"(AJ133/Instructions!$C$30)*100","v":0},{"$f":"(AN133/Instructions!$C$31)*100","v":0},0,{"$f":"(AS133/Instructions!$C$33)*100","v":{"$error":"#VALUE!"}},"----","E","E","E","E","E","E","E","E","E","E","--","E",null,null,null,null,{"$f":"Table_2[[#This Row],[Column51]]&Table_2[[#This Row],[Column52]]&BU135","v":""}]
[132,null,null,null,null,null,null,null,null,null,null,null,0,null,null,0,null,null,0,null,null,0,null,null,0,null,null,0,null,null,null,0,null,null,null,{"$f":"IF(AG134<Instructions!D163,AG134,SUM(AG134:AI134))","v":0},null,null,null,{"$f":"IF(AK134<Instructions!D162,AK134,SUM(AK134:AM134))","v":0},null,null,null,{"$f":"IF(AO134<Instructions!D161,AO134,SUM(AO134:AQ134))","v":0},"--",0,{"$f":"SUM(Table_2[[#This Row],[Column20]],Table_2[[#This Row],[Column19]],Table_2[[#This Row],[Column18]])","v":0},"HEALTH & PHY. EDU.",{"$f":"(M134/Instructions!$C$23)*100","v":0},{"$f":"(P134/Instructions!$C$24)*100","v":0},{"$f":"(S134/Instructions!$C$25)*100","v":0},{"$f":"(V134/Instructions!$C$26)*100","v":0},{"$f":"(Y134/Instructions!$C$27)*100","v":0},{"$f":"(AB134/Instructions!$C$28)*100","v":0},{"$f":"(AF134/Instructions!$C$29)*100","v":0},{"$f":"(AJ134/Instructions!$C$30)*100","v":0},{"$f":"(AN134/Instructions!$C$31)*100","v":0},0,{"$f":"(AS134/Instructions!$C$33)*100","v":{"$error":"#VALUE!"}},"----","E","E","E","E","E","E","E","E","E","E","--","E",null,null,null,null,{"$f":"Table_2[[#This Row],[Column51]]&Table_2[[#This Row],[Column52]]&BU136","v":""}]
[133,null,null,null,null,null,null,null,null,null,null,null,0,null,null,0,null,null,0,null,null,0,null,null,0,null,null,0,null,null,null,0,null,null,null,{"$f":"IF(AG135<Instructions!D164,AG135,SUM(AG135:AI135))","v":0},null,null,null,{"$f":"IF(AK135<Instructions!D163,AK135,SUM(AK135:AM135))","v":0},null,null,null,{"$f":"IF(AO135<Instructions!D162,AO135,SUM(AO135:AQ135))","v":0},"--",0,{"$f":"SUM(Table_2[[#This Row],[Column20]],Table_2[[#This Row],[Column19]],Table_2[[#This Row],[Column18]])","v":0},"HEALTH & PHY. EDU.",{"$f":"(M135/Instructions!$C$23)*100","v":0},{"$f":"(P135/Instructions!$C$24)*100","v":0},{"$f":"(S135/Instructions!$C$25)*100","v":0},{"$f":"(V135/Instructions!$C$26)*100","v":0},{"$f":"(Y135/Instructions!$C$27)*100","v":0},{"$f":"(AB135/Instructions!$C$28)*100","v":0},{"$f":"(AF135/Instructions!$C$29)*100","v":0},{"$f":"(AJ135/Instructions!$C$30)*100","v":0},{"$f":"(AN135/Instructions!$C$31)*100","v":0},0,{"$f":"(AS135/Instructions!$C$33)*100","v":{"$error":"#VALUE!"}},"----","E","E","E","E","E","E","E","E","E","E","--","E",null,null,null,null,{"$f":"Table_2[[#This Row],[Column51]]&Table_2[[#This Row],[Column52]]&BU137","v":""}]
[134,null,null,null,null,null,null,null,null,null,null,null,0,null,null,0,null,null,0,null,null,0,null,null,0,null,null,0,null,null,null,0,null,null,null,{"$f":"IF(AG136<Instructions!D165,AG136,SUM(AG136:AI136))","v":0},null,null,null,{"$f":"IF(AK136<Instructions!D164,AK136,SUM(AK136:AM136))","v":0},null,null,null,{"$f":"IF(AO136<Instructions!D163,AO136,SUM(AO136:AQ136))","v":0},"--",0,{"$f":"SUM(Table_2[[#This Row],[Column20]],Table_2[[#This Row],[Column19]],Table_2[[#This Row],[Column18]])","v":0},"HEALTH & PHY. EDU.",{"$f":"(M136/Instructions!$C$23)*100","v":0},{"$f":"(P136/Instructions!$C$24)*100","v":0},{"$f":"(S136/Instructions!$C$25)*100","v":0},{"$f":"(V136/Instructions!$C$26)*100","v":0},{"$f":"(Y136/Instructions!$C$27)*100","v":0},{"$f":"(AB136/Instructions!$C$28)*100","v":0},{"$f":"(AF136/Instructions!$C$29)*100","v":0},{"$f":"(AJ136/Instructions!$C$30)*100","v":0},{"$f":"(AN136/Instructions!$C$31)*100","v":0},0,{"$f":"(AS136/Instructions!$C$33)*100","v":{"$error":"#VALUE!"}},"----","E","E","E","E","E","E","E","E","E","E","--","E",null,null,null,null,{"$f":"Table_2[[#This Row],[Column51]]&Table_2[[#This Row],[Column52]]&BU138","v":""}]
[135,null,null,null,null,null,null,null,null,null,null,null,0,null,null,0,null,null,0,null,null,0,null,null,0,null,null,0,null,null,null,0,null,null,null,{"$f":"IF(AG137<Instructions!D166,AG137,SUM(AG137:AI137))","v":0},null,null,null,{"$f":"IF(AK137<Instructions!D165,AK137,SUM(AK137:AM137))","v":0},null,null,null,{"$f":"IF(AO137<Instructions!D164,AO137,SUM(AO137:AQ137))","v":0},"--",0,{"$f":"SUM(Table_2[[#This Row],[Column20]],Table_2[[#This Row],[Column19]],Table_2[[#This Row],[Column18]])","v":0},"HEALTH & PHY. EDU.",{"$f":"(M137/Instructions!$C$23)*100","v":0},{"$f":"(P137/Instructions!$C$24)*100","v":0},{"$f":"(S137/Instructions!$C$25)*100","v":0},{"$f":"(V137/Instructions!$C$26)*100","v":0},{"$f":"(Y137/Instructions!$C$27)*100","v":0},{"$f":"(AB137/Instructions!$C$28)*100","v":0},{"$f":"(AF137/Instructions!$C$29)*100","v":0},{"$f":"(AJ137/Instructions!$C$30)*100","v":0},{"$f":"(AN137/Instructions!$C$31)*100","v":0},0,{"$f":"(AS137/Instructions!$C$33)*100","v":{"$error":"#VALUE!"}},"----","E","E","E","E","E","E","E","E","E","E","--","E",null,null,null,null,{"$f":"Table_2[[#This Row],[Column51]]&Table_2[[#This Row],[Column52]]&BU139","v":""}]
[136,null,null,null,null,null,null,null,null,null,null,null,0,null,null,0,null,null,0,null,null,0,null,null,0,null,null,0,null,null,null,0,null,null,null,{"$f":"IF(AG138<Instructions!D167,AG138,SUM(AG138:AI138))","v":0},null,null,null,{"$f":"IF(AK138<Instructions!D166,AK138,SUM(AK138:AM138))","v":0},null,null,null,{"$f":"IF(AO138<Instructions!D165,AO138,SUM(AO138:AQ138))","v":0},"--",0,{"$f":"SUM(Table_2[[#This Row],[Column20]],Table_2[[#This Row],[Column19]],Table_2[[#This Row],[Column18]])","v":0},"HEALTH & PHY. EDU.",{"$f":"(M138/Instructions!$C$23)*100","v":0},{"$f":"(P138/Instructions!$C$24)*100","v":0},{"$f":"(S138/Instructions!$C$25)*100","v":0},{"$f":"(V138/Instructions!$C$26)*100","v":0},{"$f":"(Y138/Instructions!$C$27)*100","v":0},{"$f":"(AB138/Instructions!$C$28)*100","v":0},{"$f":"(AF138/Instructions!$C$29)*100","v":0},{"$f":"(AJ138/Instructions!$C$30)*100","v":0},{"$f":"(AN138/Instructions!$C$31)*100","v":0},0,{"$f":"(AS138/Instructions!$C$33)*100","v":{"$error":"#VALUE!"}},"----","E","E","E","E","E","E","E","E","E","E","--","E",null,null,null,null,{"$f":"Table_2[[#This Row],[Column51]]&Table_2[[#This Row],[Column52]]&BU140","v":""}]
[137,null,null,null,null,null,null,null,null,null,null,null,0,null,null,0,null,null,0,null,null,0,null,null,0,null,null,0,null,null,null,0,null,null,null,{"$f":"IF(AG139<Instructions!D168,AG139,SUM(AG139:AI139))","v":0},null,null,null,{"$f":"IF(AK139<Instructions!D167,AK139,SUM(AK139:AM139))","v":0},null,null,null,{"$f":"IF(AO139<Instructions!D166,AO139,SUM(AO139:AQ139))","v":0},"--",0,{"$f":"SUM(Table_2[[#This Row],[Column20]],Table_2[[#This Row],[Column19]],Table_2[[#This Row],[Column18]])","v":0},"HEALTH & PHY. EDU.",{"$f":"(M139/Instructions!$C$23)*100","v":0},{"$f":"(P139/Instructions!$C$24)*100","v":0},{"$f":"(S139/Instructions!$C$25)*100","v":0},{"$f":"(V139/Instructions!$C$26)*100","v":0},{"$f":"(Y139/Instructions!$C$27)*100","v":0},{"$f":"(AB139/Instructions!$C$28)*100","v":0},{"$f":"(AF139/Instructions!$C$29)*100","v":0},{"$f":"(AJ139/Instructions!$C$30)*100","v":0},{"$f":"(AN139/Instructions!$C$31)*100","v":0},0,{"$f":"(AS139/Instructions!$C$33)*100","v":{"$error":"#VALUE!"}},"----","E","E","E","E","E","E","E","E","E","E","--","E",null,null,null,null,{"$f":"Table_2[[#This Row],[Column51]]&Table_2[[#This Row],[Column52]]&BU141","v":""}]
[138,null,null,null,null,null,null,null,null,null,null,null,0,null,null,0,null,null,0,null,null,0,null,null,0,null,null,0,null,null,null,0,null,null,null,{"$f":"IF(AG140<Instructions!D169,AG140,SUM(AG140:AI140))","v":0},null,null,null,{"$f":"IF(AK140<Instructions!D168,AK140,SUM(AK140:AM140))","v":0},null,null,null,{"$f":"IF(AO140<Instructions!D167,AO140,SUM(AO140:AQ140))","v":0},"--",0,{"$f":"SUM(Table_2[[#This Row],[Column20]],Table_2[[#This Row],[Column19]],Table_2[[#This Row],[Column18]])","v":0},"HEALTH & PHY. EDU.",{"$f":"(M140/Instructions!$C$23)*100","v":0},{"$f":"(P140/Instructions!$C$24)*100","v":0},{"$f":"(S140/Instructions!$C$25)*100","v":0},{"$f":"(V140/Instructions!$C$26)*100","v":0},{"$f":"(Y140/Instructions!$C$27)*100","v":0},{"$f":"(AB140/Instructions!$C$28)*100","v":0},{"$f":"(AF140/Instructions!$C$29)*100","v":0},{"$f":"(AJ140/Instructions!$C$30)*100","v":0},{"$f":"(AN140/Instructions!$C$31)*100","v":0},0,{"$f":"(AS140/Instructions!$C$33)*100","v":{"$error":"#VALUE!"}},"----","E","E","E","E","E","E","E","E","E","E","--","E",null,null,null,null,{"$f":"Table_2[[#This Row],[Column51]]&Table_2[[#This Row],[Column52]]&BU142","v":""}]
[139,null,null,null,null,null,null,null,null,null,null,null,0,null,null,0,null,null,0,null,null,0,null,null,0,null,null,0,null,null,null,0,null,null,null,{"$f":"IF(AG141<Instructions!D170,AG141,SUM(AG141:AI141))","v":0},null,null,null,{"$f":"IF(AK141<Instructions!D169,AK141,SUM(AK141:AM141))","v":0},null,null,null,{"$f":"IF(AO141<Instructions!D168,AO141,SUM(AO141:AQ141))","v":0},"--",0,{"$f":"SUM(Table_2[[#This Row],[Column20]],Table_2[[#This Row],[Column19]],Table_2[[#This Row],[Column18]])","v":0},"HEALTH & PHY. EDU.",{"$f":"(M141/Instructions!$C$23)*100","v":0},{"$f":"(P141/Instructions!$C$24)*100","v":0},{"$f":"(S141/Instructions!$C$25)*100","v":0},{"$f":"(V141/Instructions!$C$26)*100","v":0},{"$f":"(Y141/Instructions!$C$27)*100","v":0},{"$f":"(AB141/Instructions!$C$28)*100","v":0},{"$f":"(AF141/Instructions!$C$29)*100","v":0},{"$f":"(AJ141/Instructions!$C$30)*100","v":0},{"$f":"(AN141/Instructions!$C$31)*100","v":0},0,{"$f":"(AS141/Instructions!$C$33)*100","v":{"$error":"#VALUE!"}},"----","E","E","E","E","E","E","E","E","E","E","--","E",null,null,null,null,{"$f":"Table_2[[#This Row],[Column51]]&Table_2[[#This Row],[Column52]]&BU143","v":""}]
[140,null,null,null,null,null,null,null,null,null,null,null,0,null,null,0,null,null,0,null,null,0,null,null,0,null,null,0,null,null,null,0,null,null,null,{"$f":"IF(AG142<Instructions!D171,AG142,SUM(AG142:AI142))","v":0},null,null,null,{"$f":"IF(AK142<Instructions!D170,AK142,SUM(AK142:AM142))","v":0},null,null,null,{"$f":"IF(AO142<Instructions!D169,AO142,SUM(AO142:AQ142))","v":0},"--",0,{"$f":"SUM(Table_2[[#This Row],[Column20]],Table_2[[#This Row],[Column19]],Table_2[[#This Row],[Column18]])","v":0},"HEALTH & PHY. EDU.",{"$f":"(M142/Instructions!$C$23)*100","v":0},{"$f":"(P142/Instructions!$C$24)*100","v":0},{"$f":"(S142/Instructions!$C$25)*100","v":0},{"$f":"(V142/Instructions!$C$26)*100","v":0},{"$f":"(Y142/Instructions!$C$27)*100","v":0},{"$f":"(AB142/Instructions!$C$28)*100","v":0},{"$f":"(AF142/Instructions!$C$29)*100","v":0},{"$f":"(AJ142/Instructions!$C$30)*100","v":0},{"$f":"(AN142/Instructions!$C$31)*100","v":0},0,{"$f":"(AS142/Instructions!$C$33)*100","v":{"$error":"#VALUE!"}},"----","E","E","E","E","E","E","E","E","E","E","--","E",null,null,null,null,{"$f":"Table_2[[#This Row],[Column51]]&Table_2[[#This Row],[Column52]]&BU144","v":""}]
[141,null,null,null,null,null,null,null,null,null,null,null,0,null,null,0,null,null,0,null,null,0,null,null,0,null,null,0,null,null,null,0,null,null,null,{"$f":"IF(AG143<Instructions!D172,AG143,SUM(AG143:AI143))","v":0},null,null,null,{"$f":"IF(AK143<Instructions!D171,AK143,SUM(AK143:AM143))","v":0},null,null,null,{"$f":"IF(AO143<Instructions!D170,AO143,SUM(AO143:AQ143))","v":0},"--",0,{"$f":"SUM(Table_2[[#This Row],[Column20]],Table_2[[#This Row],[Column19]],Table_2[[#This Row],[Column18]])","v":0},"HEALTH & PHY. EDU.",{"$f":"(M143/Instructions!$C$23)*100","v":0},{"$f":"(P143/Instructions!$C$24)*100","v":0},{"$f":"(S143/Instructions!$C$25)*100","v":0},{"$f":"(V143/Instructions!$C$26)*100","v":0},{"$f":"(Y143/Instructions!$C$27)*100","v":0},{"$f":"(AB143/Instructions!$C$28)*100","v":0},{"$f":"(AF143/Instructions!$C$29)*100","v":0},{"$f":"(AJ143/Instructions!$C$30)*100","v":0},{"$f":"(AN143/Instructions!$C$31)*100","v":0},0,{"$f":"(AS143/Instructions!$C$33)*100","v":{"$error":"#VALUE!"}},"----","E","E","E","E","E","E","E","E","E","E","--","E",null,null,null,null,{"$f":"Table_2[[#This Row],[Column51]]&Table_2[[#This Row],[Column52]]&BU145","v":""}]
[142,null,null,null,null,null,null,null,null,null,null,null,0,null,null,0,null,null,0,null,null,0,null,null,0,null,null,0,null,null,null,0,null,null,null,{"$f":"IF(AG144<Instructions!D173,AG144,SUM(AG144:AI144))","v":0},null,null,null,{"$f":"IF(AK144<Instructions!D172,AK144,SUM(AK144:AM144))","v":0},null,null,null,{"$f":"IF(AO144<Instructions!D171,AO144,SUM(AO144:AQ144))","v":0},"--",0,{"$f":"SUM(Table_2[[#This Row],[Column20]],Table_2[[#This Row],[Column19]],Table_2[[#This Row],[Column18]])","v":0},"HEALTH & PHY. EDU.",{"$f":"(M144/Instructions!$C$23)*100","v":0},{"$f":"(P144/Instructions!$C$24)*100","v":0},{"$f":"(S144/Instructions!$C$25)*100","v":0},{"$f":"(V144/Instructions!$C$26)*100","v":0},{"$f":"(Y144/Instructions!$C$27)*100","v":0},{"$f":"(AB144/Instructions!$C$28)*100","v":0},{"$f":"(AF144/Instructions!$C$29)*100","v":0},{"$f":"(AJ144/Instructions!$C$30)*100","v":0},{"$f":"(AN144/Instructions!$C$31)*100","v":0},0,{"$f":"(AS144/Instructions!$C$33)*100","v":{"$error":"#VALUE!"}},"----","E","E","E","E","E","E","E","E","E","E","--","E",null,null,null,null,{"$f":"Table_2[[#This Row],[Column51]]&Table_2[[#This Row],[Column52]]&BU146","v":""}]
[143,null,null,null,null,null,null,null,null,null,null,null,0,null,null,0,null,null,0,null,null,0,null,null,0,null,null,0,null,null,null,0,null,null,null,{"$f":"IF(AG145<Instructions!D174,AG145,SUM(AG145:AI145))","v":0},null,null,null,{"$f":"IF(AK145<Instructions!D173,AK145,SUM(AK145:AM145))","v":0},null,null,null,{"$f":"IF(AO145<Instructions!D172,AO145,SUM(AO145:AQ145))","v":0},"--",0,{"$f":"SUM(Table_2[[#This Row],[Column20]],Table_2[[#This Row],[Column19]],Table_2[[#This Row],[Column18]])","v":0},"HEALTH & PHY. EDU.",{"$f":"(M145/Instructions!$C$23)*100","v":0},{"$f":"(P145/Instructions!$C$24)*100","v":0},{"$f":"(S145/Instructions!$C$25)*100","v":0},{"$f":"(V145/Instructions!$C$26)*100","v":0},{"$f":"(Y145/Instructions!$C$27)*100","v":0},{"$f":"(AB145/Instructions!$C$28)*100","v":0},{"$f":"(AF145/Instructions!$C$29)*100","v":0},{"$f":"(AJ145/Instructions!$C$30)*100","v":0},{"$f":"(AN145/Instructions!$C$31)*100","v":0},0,{"$f":"(AS145/Instructions!$C$33)*100","v":{"$error":"#VALUE!"}},"----","E","E","E","E","E","E","E","E","E","E","--","E",null,null,null,null,{"$f":"Table_2[[#This Row],[Column51]]&Table_2[[#This Row],[Column52]]&BU147","v":""}]
[144,null,null,null,null,null,null,null,null,null,null,null,0,null,null,0,null,null,0,null,null,0,null,null,0,null,null,0,null,null,null,0,null,null,null,{"$f":"IF(AG146<Instructions!D175,AG146,SUM(AG146:AI146))","v":0},null,null,null,{"$f":"IF(AK146<Instructions!D174,AK146,SUM(AK146:AM146))","v":0},null,null,null,{"$f":"IF(AO146<Instructions!D173,AO146,SUM(AO146:AQ146))","v":0},"--",0,{"$f":"SUM(Table_2[[#This Row],[Column20]],Table_2[[#This Row],[Column19]],Table_2[[#This Row],[Column18]])","v":0},"HEALTH & PHY. EDU.",{"$f":"(M146/Instructions!$C$23)*100","v":0},{"$f":"(P146/Instructions!$C$24)*100","v":0},{"$f":"(S146/Instructions!$C$25)*100","v":0},{"$f":"(V146/Instructions!$C$26)*100","v":0},{"$f":"(Y146/Instructions!$C$27)*100","v":0},{"$f":"(AB146/Instructions!$C$28)*100","v":0},{"$f":"(AF146/Instructions!$C$29)*100","v":0},{"$f":"(AJ146/Instructions!$C$30)*100","v":0},{"$f":"(AN146/Instructions!$C$31)*100","v":0},0,{"$f":"(AS146/Instructions!$C$33)*100","v":{"$error":"#VALUE!"}},"----","E","E","E","E","E","E","E","E","E","E","--","E",null,null,null,null,{"$f":"Table_2[[#This Row],[Column51]]&Table_2[[#This Row],[Column52]]&BU148","v":""}]
[145,null,null,null,null,null,null,null,null,null,null,null,0,null,null,0,null,null,0,null,null,0,null,null,0,null,null,0,null,null,null,0,null,null,null,{"$f":"IF(AG147<Instructions!D176,AG147,SUM(AG147:AI147))","v":0},null,null,null,{"$f":"IF(AK147<Instructions!D175,AK147,SUM(AK147:AM147))","v":0},null,null,null,{"$f":"IF(AO147<Instructions!D174,AO147,SUM(AO147:AQ147))","v":0},"--",0,{"$f":"SUM(Table_2[[#This Row],[Column20]],Table_2[[#This Row],[Column19]],Table_2[[#This Row],[Column18]])","v":0},"HEALTH & PHY. EDU.",{"$f":"(M147/Instructions!$C$23)*100","v":0},{"$f":"(P147/Instructions!$C$24)*100","v":0},{"$f":"(S147/Instructions!$C$25)*100","v":0},{"$f":"(V147/Instructions!$C$26)*100","v":0},{"$f":"(Y147/Instructions!$C$27)*100","v":0},{"$f":"(AB147/Instructions!$C$28)*100","v":0},{"$f":"(AF147/Instructions!$C$29)*100","v":0},{"$f":"(AJ147/Instructions!$C$30)*100","v":0},{"$f":"(AN147/Instructions!$C$31)*100","v":0},0,{"$f":"(AS147/Instructions!$C$33)*100","v":{"$error":"#VALUE!"}},"----",{"$f":"IFERROR(IF(AW147>90,\"A+\",IF(AW147>80,\"A\",IF(AW147>70,\"B+\",IF(AW147>60,\"B\",IF(AW147>50,\"C+\",IF(AW147>40,\"C\",IF(AW147>=33,\"D\",\"E\"))))))),\"Abs\")","v":"E"},"E","E","E","E","E","E","E","E","E","--","E",null,null,null,null,{"$f":"Table_2[[#This Row],[Column51]]&Table_2[[#This Row],[Column52]]&BU149","v":""}]
[146,null,null,null,null,null,null,null,null,null,null,null,0,null,null,0,null,null,0,null,null,0,null,null,0,null,null,0,null,null,null,0,null,null,null,{"$f":"IF(AG148<Instructions!D177,AG148,SUM(AG148:AI148))","v":0},null,null,null,{"$f":"IF(AK148<Instructions!D176,AK148,SUM(AK148:AM148))","v":0},null,null,null,{"$f":"IF(AO148<Instructions!D175,AO148,SUM(AO148:AQ148))","v":0},"--",0,{"$f":"SUM(Table_2[[#This Row],[Column20]],Table_2[[#This Row],[Column19]],Table_2[[#This Row],[Column18]])","v":0},"HEALTH & PHY. EDU.",{"$f":"(M148/Instructions!$C$23)*100","v":0},{"$f":"(P148/Instructions!$C$24)*100","v":0},{"$f":"(S148/Instructions!$C$25)*100","v":0},{"$f":"(V148/Instructions!$C$26)*100","v":0},{"$f":"(Y148/Instructions!$C$27)*100","v":0},{"$f":"(AB148/Instructions!$C$28)*100","v":0},{"$f":"(AF148/Instructions!$C$29)*100","v":0},{"$f":"(AJ148/Instructions!$C$30)*100","v":0},{"$f":"(AN148/Instructions!$C$31)*100","v":0},0,{"$f":"(AS148/Instructions!$C$33)*100","v":{"$error":"#VALUE!"}},"----","E","E","E","E","E","E","E","E","E","E","--","E",null,null,null,null,{"$f":"Table_2[[#This Row],[Column51]]&Table_2[[#This Row],[Column52]]&BU150","v":""}]
[147,null,null,null,null,null,null,null,null,null,null,null,0,null,null,0,null,null,0,null,null,0,null,null,0,null,null,0,null,null,null,0,null,null,null,{"$f":"IF(AG149<Instructions!D178,AG149,SUM(AG149:AI149))","v":0},null,null,null,{"$f":"IF(AK149<Instructions!D177,AK149,SUM(AK149:AM149))","v":0},null,null,null,{"$f":"IF(AO149<Instructions!D176,AO149,SUM(AO149:AQ149))","v":0},"--",0,{"$f":"SUM(Table_2[[#This Row],[Column20]],Table_2[[#This Row],[Column19]],Table_2[[#This Row],[Column18]])","v":0},"HEALTH & PHY. EDU.",{"$f":"(M149/Instructions!$C$23)*100","v":0},{"$f":"(P149/Instructions!$C$24)*100","v":0},{"$f":"(S149/Instructions!$C$25)*100","v":0},{"$f":"(V149/Instructions!$C$26)*100","v":0},{"$f":"(Y149/Instructions!$C$27)*100","v":0},{"$f":"(AB149/Instructions!$C$28)*100","v":0},{"$f":"(AF149/Instructions!$C$29)*100","v":0},{"$f":"(AJ149/Instructions!$C$30)*100","v":0},{"$f":"(AN149/Instructions!$C$31)*100","v":0},0,{"$f":"(AS149/Instructions!$C$33)*100","v":{"$error":"#VALUE!"}},"----","E","E","E","E","E","E","E","E","E","E","--","E",null,null,null,null,{"$f":"Table_2[[#This Row],[Column51]]&Table_2[[#This Row],[Column52]]&BU151","v":""}]
[148,null,null,null,null,null,null,null,null,null,null,null,0,null,null,0,null,null,0,null,null,0,null,null,0,null,null,0,null,null,null,0,null,null,null,{"$f":"IF(AG150<Instructions!D179,AG150,SUM(AG150:AI150))","v":0},null,null,null,{"$f":"IF(AK150<Instructions!D178,AK150,SUM(AK150:AM150))","v":0},null,null,null,{"$f":"IF(AO150<Instructions!D177,AO150,SUM(AO150:AQ150))","v":0},"--",0,{"$f":"SUM(Table_2[[#This Row],[Column20]],Table_2[[#This Row],[Column19]],Table_2[[#This Row],[Column18]])","v":0},"HEALTH & PHY. EDU.",{"$f":"(M150/Instructions!$C$23)*100","v":0},{"$f":"(P150/Instructions!$C$24)*100","v":0},{"$f":"(S150/Instructions!$C$25)*100","v":0},{"$f":"(V150/Instructions!$C$26)*100","v":0},{"$f":"(Y150/Instructions!$C$27)*100","v":0},{"$f":"(AB150/Instructions!$C$28)*100","v":0},{"$f":"(AF150/Instructions!$C$29)*100","v":0},{"$f":"(AJ150/Instructions!$C$30)*100","v":0},{"$f":"(AN150/Instructions!$C$31)*100","v":0},0,{"$f":"(AS150/Instructions!$C$33)*100","v":{"$error":"#VALUE!"}},"----","E","E","E","E","E","E","E","E","E","E","--","E",null,null,null,null,{"$f":"Table_2[[#This Row],[Column51]]&Table_2[[#This Row],[Column52]]&BU152","v":""}]
[149,null,null,null,null,null,null,null,null,null,null,null,0,null,null,0,null,null,0,null,null,0,null,null,0,null,null,0,null,null,null,0,null,null,null,{"$f":"IF(AG151<Instructions!D180,AG151,SUM(AG151:AI151))","v":0},null,null,null,{"$f":"IF(AK151<Instructions!D179,AK151,SUM(AK151:AM151))","v":0},null,null,null,{"$f":"IF(AO151<Instructions!D178,AO151,SUM(AO151:AQ151))","v":0},"--",0,{"$f":"SUM(Table_2[[#This Row],[Column20]],Table_2[[#This Row],[Column19]],Table_2[[#This Row],[Column18]])","v":0},"HEALTH & PHY. EDU.",{"$f":"(M151/Instructions!$C$23)*100","v":0},{"$f":"(P151/Instructions!$C$24)*100","v":0},{"$f":"(S151/Instructions!$C$25)*100","v":0},{"$f":"(V151/Instructions!$C$26)*100","v":0},{"$f":"(Y151/Instructions!$C$27)*100","v":0},{"$f":"(AB151/Instructions!$C$28)*100","v":0},{"$f":"(AF151/Instructions!$C$29)*100","v":0},{"$f":"(AJ151/Instructions!$C$30)*100","v":0},{"$f":"(AN151/Instructions!$C$31)*100","v":0},0,{"$f":"(AS151/Instructions!$C$33)*100","v":{"$error":"#VALUE!"}},"----","E","E","E","E","E","E","E","E","E","E","--","E",null,null,null,null,{"$f":"Table_2[[#This Row],[Column51]]&Table_2[[#This Row],[Column52]]&BU153","v":""}]
[150,null,null,null,null,null,null,null,null,null,null,null,0,null,null,0,null,null,0,null,null,0,null,null,0,null,null,0,null,null,null,0,null,null,null,{"$f":"IF(AG152<Instructions!D181,AG152,SUM(AG152:AI152))","v":0},null,null,null,{"$f":"IF(AK152<Instructions!D180,AK152,SUM(AK152:AM152))","v":0},null,null,null,{"$f":"IF(AO152<Instructions!D179,AO152,SUM(AO152:AQ152))","v":0},"--",0,{"$f":"SUM(Table_2[[#This Row],[Column20]],Table_2[[#This Row],[Column19]],Table_2[[#This Row],[Column18]])","v":0},"HEALTH & PHY. EDU.",{"$f":"(M152/Instructions!$C$23)*100","v":0},{"$f":"(P152/Instructions!$C$24)*100","v":0},{"$f":"(S152/Instructions!$C$25)*100","v":0},{"$f":"(V152/Instructions!$C$26)*100","v":0},{"$f":"(Y152/Instructions!$C$27)*100","v":0},{"$f":"(AB152/Instructions!$C$28)*100","v":0},{"$f":"(AF152/Instructions!$C$29)*100","v":0},{"$f":"(AJ152/Instructions!$C$30)*100","v":0},{"$f":"(AN152/Instructions!$C$31)*100","v":0},0,{"$f":"(AS152/Instructions!$C$33)*100","v":{"$error":"#VALUE!"}},"----","E","E","E","E","E","E","E","E","E","E","--","E",null,null,null,null,{"$f":"Table_2[[#This Row],[Column51]]&Table_2[[#This Row],[Column52]]&BU154","v":""}]
[151,null,null,null,null,null,null,null,null,null,null,null,0,null,null,0,null,null,0,null,null,0,null,null,0,null,null,0,null,null,null,0,null,null,null,{"$f":"IF(AG153<Instructions!D182,AG153,SUM(AG153:AI153))","v":0},null,null,null,{"$f":"IF(AK153<Instructions!D181,AK153,SUM(AK153:AM153))","v":0},null,null,null,{"$f":"IF(AO153<Instructions!D180,AO153,SUM(AO153:AQ153))","v":0},"--",0,{"$f":"SUM(Table_2[[#This Row],[Column20]],Table_2[[#This Row],[Column19]],Table_2[[#This Row],[Column18]])","v":0},"HEALTH & PHY. EDU.",{"$f":"(M153/Instructions!$C$23)*100","v":0},{"$f":"(P153/Instructions!$C$24)*100","v":0},{"$f":"(S153/Instructions!$C$25)*100","v":0},{"$f":"(V153/Instructions!$C$26)*100","v":0},{"$f":"(Y153/Instructions!$C$27)*100","v":0},{"$f":"(AB153/Instructions!$C$28)*100","v":0},{"$f":"(AF153/Instructions!$C$29)*100","v":0},{"$f":"(AJ153/Instructions!$C$30)*100","v":0},{"$f":"(AN153/Instructions!$C$31)*100","v":0},0,{"$f":"(AS153/Instructions!$C$33)*100","v":{"$error":"#VALUE!"}},"----","E","E","E","E","E","E","E","E","E","E","--","E",null,null,null,null,{"$f":"Table_2[[#This Row],[Column51]]&Table_2[[#This Row],[Column52]]&BU155","v":""}]
[152,null,null,null,null,null,null,null,null,null,null,null,0,null,null,0,null,null,0,null,null,0,null,null,0,null,null,0,null,null,null,0,null,null,null,{"$f":"IF(AG154<Instructions!D183,AG154,SUM(AG154:AI154))","v":0},null,null,null,{"$f":"IF(AK154<Instructions!D182,AK154,SUM(AK154:AM154))","v":0},null,null,null,{"$f":"IF(AO154<Instructions!D181,AO154,SUM(AO154:AQ154))","v":0},"--",0,{"$f":"SUM(Table_2[[#This Row],[Column20]],Table_2[[#This Row],[Column19]],Table_2[[#This Row],[Column18]])","v":0},"HEALTH & PHY. EDU.",{"$f":"(M154/Instructions!$C$23)*100","v":0},{"$f":"(P154/Instructions!$C$24)*100","v":0},{"$f":"(S154/Instructions!$C$25)*100","v":0},{"$f":"(V154/Instructions!$C$26)*100","v":0},{"$f":"(Y154/Instructions!$C$27)*100","v":0},{"$f":"(AB154/Instructions!$C$28)*100","v":0},{"$f":"(AF154/Instructions!$C$29)*100","v":0},{"$f":"(AJ154/Instructions!$C$30)*100","v":0},{"$f":"(AN154/Instructions!$C$31)*100","v":0},0,{"$f":"(AS154/Instructions!$C$33)*100","v":{"$error":"#VALUE!"}},"----","E","E","E","E","E","E","E","E","E","E","--","E",null,null,null,null,{"$f":"Table_2[[#This Row],[Column51]]&Table_2[[#This Row],[Column52]]&BU156","v":""}]
[153,null,null,null,null,null,null,null,null,null,null,null,0,null,null,0,null,null,0,null,null,0,null,null,0,null,null,0,null,null,null,0,null,null,null,{"$f":"IF(AG155<Instructions!D184,AG155,SUM(AG155:AI155))","v":0},null,null,null,{"$f":"IF(AK155<Instructions!D183,AK155,SUM(AK155:AM155))","v":0},null,null,null,{"$f":"IF(AO155<Instructions!D182,AO155,SUM(AO155:AQ155))","v":0},"--",0,{"$f":"SUM(Table_2[[#This Row],[Column20]],Table_2[[#This Row],[Column19]],Table_2[[#This Row],[Column18]])","v":0},"HEALTH & PHY. EDU.",{"$f":"(M155/Instructions!$C$23)*100","v":0},{"$f":"(P155/Instructions!$C$24)*100","v":0},{"$f":"(S155/Instructions!$C$25)*100","v":0},{"$f":"(V155/Instructions!$C$26)*100","v":0},{"$f":"(Y155/Instructions!$C$27)*100","v":0},{"$f":"(AB155/Instructions!$C$28)*100","v":0},{"$f":"(AF155/Instructions!$C$29)*100","v":0},{"$f":"(AJ155/Instructions!$C$30)*100","v":0},{"$f":"(AN155/Instructions!$C$31)*100","v":0},0,{"$f":"(AS155/Instructions!$C$33)*100","v":{"$error":"#VALUE!"}},"----","E","E","E","E","E","E","E","E","E","E","--","E",null,null,null,null,{"$f":"Table_2[[#This Row],[Column51]]&Table_2[[#This Row],[Column52]]&BU157","v":""}]
[154,null,null,null,null,null,null,null,null,null,null,null,0,null,null,0,null,null,0,null,null,0,null,null,0,null,null,0,null,null,null,0,null,null,null,{"$f":"IF(AG156<Instructions!D185,AG156,SUM(AG156:AI156))","v":0},null,null,null,{"$f":"IF(AK156<Instructions!D184,AK156,SUM(AK156:AM156))","v":0},null,null,null,{"$f":"IF(AO156<Instructions!D183,AO156,SUM(AO156:AQ156))","v":0},"--",0,{"$f":"SUM(Table_2[[#This Row],[Column20]],Table_2[[#This Row],[Column19]],Table_2[[#This Row],[Column18]])","v":0},"HEALTH & PHY. EDU.",{"$f":"(M156/Instructions!$C$23)*100","v":0},{"$f":"(P156/Instructions!$C$24)*100","v":0},{"$f":"(S156/Instructions!$C$25)*100","v":0},{"$f":"(V156/Instructions!$C$26)*100","v":0},{"$f":"(Y156/Instructions!$C$27)*100","v":0},{"$f":"(AB156/Instructions!$C$28)*100","v":0},{"$f":"(AF156/Instructions!$C$29)*100","v":0},{"$f":"(AJ156/Instructions!$C$30)*100","v":0},{"$f":"(AN156/Instructions!$C$31)*100","v":0},0,{"$f":"(AS156/Instructions!$C$33)*100","v":{"$error":"#VALUE!"}},"----","E","E","E","E","E","E","E","E","E","E","--","E",null,null,null,null,{"$f":"Table_2[[#This Row],[Column51]]&Table_2[[#This Row],[Column52]]&BU158","v":""}]
[155,null,null,null,null,null,null,null,null,null,null,null,0,null,null,0,null,null,0,null,null,0,null,null,0,null,null,0,null,null,null,0,null,null,null,{"$f":"IF(AG157<Instructions!D186,AG157,SUM(AG157:AI157))","v":0},null,null,null,{"$f":"IF(AK157<Instructions!D185,AK157,SUM(AK157:AM157))","v":0},null,null,null,{"$f":"IF(AO157<Instructions!D184,AO157,SUM(AO157:AQ157))","v":0},"--",0,{"$f":"SUM(Table_2[[#This Row],[Column20]],Table_2[[#This Row],[Column19]],Table_2[[#This Row],[Column18]])","v":0},"HEALTH & PHY. EDU.",{"$f":"(M157/Instructions!$C$23)*100","v":0},{"$f":"(P157/Instructions!$C$24)*100","v":0},{"$f":"(S157/Instructions!$C$25)*100","v":0},{"$f":"(V157/Instructions!$C$26)*100","v":0},{"$f":"(Y157/Instructions!$C$27)*100","v":0},{"$f":"(AB157/Instructions!$C$28)*100","v":0},{"$f":"(AF157/Instructions!$C$29)*100","v":0},{"$f":"(AJ157/Instructions!$C$30)*100","v":0},{"$f":"(AN157/Instructions!$C$31)*100","v":0},0,{"$f":"(AS157/Instructions!$C$33)*100","v":{"$error":"#VALUE!"}},"----","E","E","E","E","E","E","E","E","E","E","--","E",null,null,null,null,{"$f":"Table_2[[#This Row],[Column51]]&Table_2[[#This Row],[Column52]]&BU159","v":""}]
[156,null,null,null,null,null,null,null,null,null,null,null,0,null,null,0,null,null,0,null,null,0,null,null,0,null,null,0,null,null,null,0,null,null,null,{"$f":"IF(AG158<Instructions!D187,AG158,SUM(AG158:AI158))","v":0},null,null,null,{"$f":"IF(AK158<Instructions!D186,AK158,SUM(AK158:AM158))","v":0},null,null,null,{"$f":"IF(AO158<Instructions!D185,AO158,SUM(AO158:AQ158))","v":0},"--",0,{"$f":"SUM(Table_2[[#This Row],[Column20]],Table_2[[#This Row],[Column19]],Table_2[[#This Row],[Column18]])","v":0},"HEALTH & PHY. EDU.",{"$f":"(M158/Instructions!$C$23)*100","v":0},{"$f":"(P158/Instructions!$C$24)*100","v":0},{"$f":"(S158/Instructions!$C$25)*100","v":0},{"$f":"(V158/Instructions!$C$26)*100","v":0},{"$f":"(Y158/Instructions!$C$27)*100","v":0},{"$f":"(AB158/Instructions!$C$28)*100","v":0},{"$f":"(AF158/Instructions!$C$29)*100","v":0},{"$f":"(AJ158/Instructions!$C$30)*100","v":0},{"$f":"(AN158/Instructions!$C$31)*100","v":0},0,{"$f":"(AS158/Instructions!$C$33)*100","v":{"$error":"#VALUE!"}},"----","E","E","E","E","E","E","E","E","E","E","--","E",null,null,null,null,{"$f":"Table_2[[#This Row],[Column51]]&Table_2[[#This Row],[Column52]]&BU160","v":""}]
[157,null,null,null,null,null,null,null,null,null,null,null,0,null,null,0,null,null,0,null,null,0,null,null,0,null,null,0,null,null,null,0,null,null,null,{"$f":"IF(AG159<Instructions!D188,AG159,SUM(AG159:AI159))","v":0},null,null,null,{"$f":"IF(AK159<Instructions!D187,AK159,SUM(AK159:AM159))","v":0},null,null,null,{"$f":"IF(AO159<Instructions!D186,AO159,SUM(AO159:AQ159))","v":0},"--",0,{"$f":"SUM(Table_2[[#This Row],[Column20]],Table_2[[#This Row],[Column19]],Table_2[[#This Row],[Column18]])","v":0},"HEALTH & PHY. EDU.",{"$f":"(M159/Instructions!$C$23)*100","v":0},{"$f":"(P159/Instructions!$C$24)*100","v":0},{"$f":"(S159/Instructions!$C$25)*100","v":0},{"$f":"(V159/Instructions!$C$26)*100","v":0},{"$f":"(Y159/Instructions!$C$27)*100","v":0},{"$f":"(AB159/Instructions!$C$28)*100","v":0},{"$f":"(AF159/Instructions!$C$29)*100","v":0},{"$f":"(AJ159/Instructions!$C$30)*100","v":0},{"$f":"(AN159/Instructions!$C$31)*100","v":0},0,{"$f":"(AS159/Instructions!$C$33)*100","v":{"$error":"#VALUE!"}},"----","E","E","E","E","E","E","E","E","E","E","--","E",null,null,null,null,{"$f":"Table_2[[#This Row],[Column51]]&Table_2[[#This Row],[Column52]]&BU161","v":""}]
[158,null,null,null,null,null,null,null,null,null,null,null,0,null,null,0,null,null,0,null,null,0,null,null,0,null,null,0,null,null,null,0,null,null,null,{"$f":"IF(AG160<Instructions!D189,AG160,SUM(AG160:AI160))","v":0},null,null,null,{"$f":"IF(AK160<Instructions!D188,AK160,SUM(AK160:AM160))","v":0},null,null,null,{"$f":"IF(AO160<Instructions!D187,AO160,SUM(AO160:AQ160))","v":0},"--",0,{"$f":"SUM(Table_2[[#This Row],[Column20]],Table_2[[#This Row],[Column19]],Table_2[[#This Row],[Column18]])","v":0},"HEALTH & PHY. EDU.",{"$f":"(M160/Instructions!$C$23)*100","v":0},{"$f":"(P160/Instructions!$C$24)*100","v":0},{"$f":"(S160/Instructions!$C$25)*100","v":0},{"$f":"(V160/Instructions!$C$26)*100","v":0},{"$f":"(Y160/Instructions!$C$27)*100","v":0},{"$f":"(AB160/Instructions!$C$28)*100","v":0},{"$f":"(AF160/Instructions!$C$29)*100","v":0},{"$f":"(AJ160/Instructions!$C$30)*100","v":0},{"$f":"(AN160/Instructions!$C$31)*100","v":0},0,{"$f":"(AS160/Instructions!$C$33)*100","v":{"$error":"#VALUE!"}},"----","E","E","E","E","E","E","E","E","E","E","--","E",null,null,null,null,{"$f":"Table_2[[#This Row],[Column51]]&Table_2[[#This Row],[Column52]]&BU162","v":""}]
[159,null,null,null,null,null,null,null,null,null,null,null,0,null,null,0,null,null,0,null,null,0,null,null,0,null,null,0,null,null,null,0,null,null,null,{"$f":"IF(AG161<Instructions!D190,AG161,SUM(AG161:AI161))","v":0},null,null,null,{"$f":"IF(AK161<Instructions!D189,AK161,SUM(AK161:AM161))","v":0},null,null,null,{"$f":"IF(AO161<Instructions!D188,AO161,SUM(AO161:AQ161))","v":0},"--",0,{"$f":"SUM(Table_2[[#This Row],[Column20]],Table_2[[#This Row],[Column19]],Table_2[[#This Row],[Column18]])","v":0},"HEALTH & PHY. EDU.",{"$f":"(M161/Instructions!$C$23)*100","v":0},{"$f":"(P161/Instructions!$C$24)*100","v":0},{"$f":"(S161/Instructions!$C$25)*100","v":0},{"$f":"(V161/Instructions!$C$26)*100","v":0},{"$f":"(Y161/Instructions!$C$27)*100","v":0},{"$f":"(AB161/Instructions!$C$28)*100","v":0},{"$f":"(AF161/Instructions!$C$29)*100","v":0},{"$f":"(AJ161/Instructions!$C$30)*100","v":0},{"$f":"(AN161/Instructions!$C$31)*100","v":0},0,{"$f":"(AS161/Instructions!$C$33)*100","v":{"$error":"#VALUE!"}},"----","E","E","E","E","E","E","E","E","E","E","--","E",null,null,null,null,{"$f":"Table_2[[#This Row],[Column51]]&Table_2[[#This Row],[Column52]]&BU163","v":""}]
[160,null,null,null,null,null,null,null,null,null,null,null,0,null,null,0,null,null,0,null,null,0,null,null,0,null,null,0,null,null,null,0,null,null,null,{"$f":"IF(AG162<Instructions!D191,AG162,SUM(AG162:AI162))","v":0},null,null,null,{"$f":"IF(AK162<Instructions!D190,AK162,SUM(AK162:AM162))","v":0},null,null,null,{"$f":"IF(AO162<Instructions!D189,AO162,SUM(AO162:AQ162))","v":0},"--",0,{"$f":"SUM(Table_2[[#This Row],[Column20]],Table_2[[#This Row],[Column19]],Table_2[[#This Row],[Column18]])","v":0},"HEALTH & PHY. EDU.",{"$f":"(M162/Instructions!$C$23)*100","v":0},{"$f":"(P162/Instructions!$C$24)*100","v":0},{"$f":"(S162/Instructions!$C$25)*100","v":0},{"$f":"(V162/Instructions!$C$26)*100","v":0},{"$f":"(Y162/Instructions!$C$27)*100","v":0},{"$f":"(AB162/Instructions!$C$28)*100","v":0},{"$f":"(AF162/Instructions!$C$29)*100","v":0},{"$f":"(AJ162/Instructions!$C$30)*100","v":0},{"$f":"(AN162/Instructions!$C$31)*100","v":0},0,{"$f":"(AS162/Instructions!$C$33)*100","v":{"$error":"#VALUE!"}},"----","E","E","E","E","E","E","E","E","E","E","--","E",null,null,null,null,{"$f":"Table_2[[#This Row],[Column51]]&Table_2[[#This Row],[Column52]]&BU164","v":""}]
[161,null,null,null,null,null,null,null,null,null,null,null,0,null,null,0,null,null,0,null,null,0,null,null,0,null,null,0,null,null,null,0,null,null,null,{"$f":"IF(AG163<Instructions!D192,AG163,SUM(AG163:AI163))","v":0},null,null,null,{"$f":"IF(AK163<Instructions!D191,AK163,SUM(AK163:AM163))","v":0},null,null,null,{"$f":"IF(AO163<Instructions!D190,AO163,SUM(AO163:AQ163))","v":0},"--",0,{"$f":"SUM(Table_2[[#This Row],[Column20]],Table_2[[#This Row],[Column19]],Table_2[[#This Row],[Column18]])","v":0},"HEALTH & PHY. EDU.",{"$f":"(M163/Instructions!$C$23)*100","v":0},{"$f":"(P163/Instructions!$C$24)*100","v":0},{"$f":"(S163/Instructions!$C$25)*100","v":0},{"$f":"(V163/Instructions!$C$26)*100","v":0},{"$f":"(Y163/Instructions!$C$27)*100","v":0},{"$f":"(AB163/Instructions!$C$28)*100","v":0},{"$f":"(AF163/Instructions!$C$29)*100","v":0},{"$f":"(AJ163/Instructions!$C$30)*100","v":0},{"$f":"(AN163/Instructions!$C$31)*100","v":0},0,{"$f":"(AS163/Instructions!$C$33)*100","v":{"$error":"#VALUE!"}},"----","E","E","E","E","E","E","E","E","E","E","--","E",null,null,null,null,{"$f":"Table_2[[#This Row],[Column51]]&Table_2[[#This Row],[Column52]]&BU165","v":""}]
[162,null,null,null,null,null,null,null,null,null,null,null,0,null,null,0,null,null,0,null,null,0,null,null,0,null,null,0,null,null,null,0,null,null,null,{"$f":"IF(AG164<Instructions!D193,AG164,SUM(AG164:AI164))","v":0},null,null,null,{"$f":"IF(AK164<Instructions!D192,AK164,SUM(AK164:AM164))","v":0},null,null,null,{"$f":"IF(AO164<Instructions!D191,AO164,SUM(AO164:AQ164))","v":0},"--",0,{"$f":"SUM(Table_2[[#This Row],[Column20]],Table_2[[#This Row],[Column19]],Table_2[[#This Row],[Column18]])","v":0},"HEALTH & PHY. EDU.",{"$f":"(M164/Instructions!$C$23)*100","v":0},{"$f":"(P164/Instructions!$C$24)*100","v":0},{"$f":"(S164/Instructions!$C$25)*100","v":0},{"$f":"(V164/Instructions!$C$26)*100","v":0},{"$f":"(Y164/Instructions!$C$27)*100","v":0},{"$f":"(AB164/Instructions!$C$28)*100","v":0},{"$f":"(AF164/Instructions!$C$29)*100","v":0},{"$f":"(AJ164/Instructions!$C$30)*100","v":0},{"$f":"(AN164/Instructions!$C$31)*100","v":0},0,{"$f":"(AS164/Instructions!$C$33)*100","v":{"$error":"#VALUE!"}},"----","E","E","E","E","E","E","E","E","E","E","--","E",null,null,null,null,{"$f":"Table_2[[#This Row],[Column51]]&Table_2[[#This Row],[Column52]]&BU166","v":""}]
[163,null,null,null,null,null,null,null,null,null,null,null,0,null,null,0,null,null,0,null,null,0,null,null,0,null,null,0,null,null,null,0,null,null,null,{"$f":"IF(AG165<Instructions!D194,AG165,SUM(AG165:AI165))","v":0},null,null,null,{"$f":"IF(AK165<Instructions!D193,AK165,SUM(AK165:AM165))","v":0},null,null,null,{"$f":"IF(AO165<Instructions!D192,AO165,SUM(AO165:AQ165))","v":0},"--",0,{"$f":"SUM(Table_2[[#This Row],[Column20]],Table_2[[#This Row],[Column19]],Table_2[[#This Row],[Column18]])","v":0},"HEALTH & PHY. EDU.",{"$f":"(M165/Instructions!$C$23)*100","v":0},{"$f":"(P165/Instructions!$C$24)*100","v":0},{"$f":"(S165/Instructions!$C$25)*100","v":0},{"$f":"(V165/Instructions!$C$26)*100","v":0},{"$f":"(Y165/Instructions!$C$27)*100","v":0},{"$f":"(AB165/Instructions!$C$28)*100","v":0},{"$f":"(AF165/Instructions!$C$29)*100","v":0},{"$f":"(AJ165/Instructions!$C$30)*100","v":0},{"$f":"(AN165/Instructions!$C$31)*100","v":0},0,{"$f":"(AS165/Instructions!$C$33)*100","v":{"$error":"#VALUE!"}},"----","E","E","E","E","E","E","E","E","E","E","--","E",null,null,null,null,{"$f":"Table_2[[#This Row],[Column51]]&Table_2[[#This Row],[Column52]]&BU167","v":""}]
[164,null,null,null,null,null,null,null,null,null,null,null,0,null,null,0,null,null,0,null,null,0,null,null,0,null,null,0,null,null,null,0,null,null,null,{"$f":"IF(AG166<Instructions!D195,AG166,SUM(AG166:AI166))","v":0},null,null,null,{"$f":"IF(AK166<Instructions!D194,AK166,SUM(AK166:AM166))","v":0},null,null,null,{"$f":"IF(AO166<Instructions!D193,AO166,SUM(AO166:AQ166))","v":0},"--",0,{"$f":"SUM(Table_2[[#This Row],[Column20]],Table_2[[#This Row],[Column19]],Table_2[[#This Row],[Column18]])","v":0},"HEALTH & PHY. EDU.",{"$f":"(M166/Instructions!$C$23)*100","v":0},{"$f":"(P166/Instructions!$C$24)*100","v":0},{"$f":"(S166/Instructions!$C$25)*100","v":0},{"$f":"(V166/Instructions!$C$26)*100","v":0},{"$f":"(Y166/Instructions!$C$27)*100","v":0},{"$f":"(AB166/Instructions!$C$28)*100","v":0},{"$f":"(AF166/Instructions!$C$29)*100","v":0},{"$f":"(AJ166/Instructions!$C$30)*100","v":0},{"$f":"(AN166/Instructions!$C$31)*100","v":0},0,{"$f":"(AS166/Instructions!$C$33)*100","v":{"$error":"#VALUE!"}},"----","E","E","E","E","E","E","E","E","E","E","--","E",null,null,null,null,{"$f":"Table_2[[#This Row],[Column51]]&Table_2[[#This Row],[Column52]]&BU168","v":""}]
[165,null,null,null,null,null,null,null,null,null,null,null,0,null,null,0,null,null,0,null,null,0,null,null,0,null,null,0,null,null,null,0,null,null,null,{"$f":"IF(AG167<Instructions!D196,AG167,SUM(AG167:AI167))","v":0},null,null,null,{"$f":"IF(AK167<Instructions!D195,AK167,SUM(AK167:AM167))","v":0},null,null,null,{"$f":"IF(AO167<Instructions!D194,AO167,SUM(AO167:AQ167))","v":0},"--",0,{"$f":"SUM(Table_2[[#This Row],[Column20]],Table_2[[#This Row],[Column19]],Table_2[[#This Row],[Column18]])","v":0},"HEALTH & PHY. EDU.",{"$f":"(M167/Instructions!$C$23)*100","v":0},{"$f":"(P167/Instructions!$C$24)*100","v":0},{"$f":"(S167/Instructions!$C$25)*100","v":0},{"$f":"(V167/Instructions!$C$26)*100","v":0},{"$f":"(Y167/Instructions!$C$27)*100","v":0},{"$f":"(AB167/Instructions!$C$28)*100","v":0},{"$f":"(AF167/Instructions!$C$29)*100","v":0},{"$f":"(AJ167/Instructions!$C$30)*100","v":0},{"$f":"(AN167/Instructions!$C$31)*100","v":0},0,{"$f":"(AS167/Instructions!$C$33)*100","v":{"$error":"#VALUE!"}},"----","E","E","E","E","E","E","E","E","E","E","--","E",null,null,null,null,{"$f":"Table_2[[#This Row],[Column51]]&Table_2[[#This Row],[Column52]]&BU169","v":""}]
[166,null,null,null,null,null,null,null,null,null,null,null,0,null,null,0,null,null,0,null,null,0,null,null,0,null,null,0,null,null,null,0,null,null,null,{"$f":"IF(AG168<Instructions!D197,AG168,SUM(AG168:AI168))","v":0},null,null,null,{"$f":"IF(AK168<Instructions!D196,AK168,SUM(AK168:AM168))","v":0},null,null,null,{"$f":"IF(AO168<Instructions!D195,AO168,SUM(AO168:AQ168))","v":0},"--",0,{"$f":"SUM(Table_2[[#This Row],[Column20]],Table_2[[#This Row],[Column19]],Table_2[[#This Row],[Column18]])","v":0},"HEALTH & PHY. EDU.",{"$f":"(M168/Instructions!$C$23)*100","v":0},{"$f":"(P168/Instructions!$C$24)*100","v":0},{"$f":"(S168/Instructions!$C$25)*100","v":0},{"$f":"(V168/Instructions!$C$26)*100","v":0},{"$f":"(Y168/Instructions!$C$27)*100","v":0},{"$f":"(AB168/Instructions!$C$28)*100","v":0},{"$f":"(AF168/Instructions!$C$29)*100","v":0},{"$f":"(AJ168/Instructions!$C$30)*100","v":0},{"$f":"(AN168/Instructions!$C$31)*100","v":0},0,{"$f":"(AS168/Instructions!$C$33)*100","v":{"$error":"#VALUE!"}},"----","E","E","E","E","E","E","E","E","E","E","--","E",null,null,null,null,{"$f":"Table_2[[#This Row],[Column51]]&Table_2[[#This Row],[Column52]]&BU170","v":""}]
[167,null,null,null,null,null,null,null,null,null,null,null,0,null,null,0,null,null,0,null,null,0,null,null,0,null,null,0,null,null,null,0,null,null,null,{"$f":"IF(AG169<Instructions!D198,AG169,SUM(AG169:AI169))","v":0},null,null,null,{"$f":"IF(AK169<Instructions!D197,AK169,SUM(AK169:AM169))","v":0},null,null,null,{"$f":"IF(AO169<Instructions!D196,AO169,SUM(AO169:AQ169))","v":0},"--",0,{"$f":"SUM(Table_2[[#This Row],[Column20]],Table_2[[#This Row],[Column19]],Table_2[[#This Row],[Column18]])","v":0},"HEALTH & PHY. EDU.",{"$f":"(M169/Instructions!$C$23)*100","v":0},{"$f":"(P169/Instructions!$C$24)*100","v":0},{"$f":"(S169/Instructions!$C$25)*100","v":0},{"$f":"(V169/Instructions!$C$26)*100","v":0},{"$f":"(Y169/Instructions!$C$27)*100","v":0},{"$f":"(AB169/Instructions!$C$28)*100","v":0},{"$f":"(AF169/Instructions!$C$29)*100","v":0},{"$f":"(AJ169/Instructions!$C$30)*100","v":0},{"$f":"(AN169/Instructions!$C$31)*100","v":0},0,{"$f":"(AS169/Instructions!$C$33)*100","v":{"$error":"#VALUE!"}},"----","E","E","E","E","E","E","E","E","E","E","--","E",null,null,null,null,{"$f":"Table_2[[#This Row],[Column51]]&Table_2[[#This Row],[Column52]]&BU171","v":""}]
[168,null,null,null,null,null,null,null,null,null,null,null,0,null,null,0,null,null,0,null,null,0,null,null,0,null,null,0,null,null,null,0,null,null,null,{"$f":"IF(AG170<Instructions!D199,AG170,SUM(AG170:AI170))","v":0},null,null,null,{"$f":"IF(AK170<Instructions!D198,AK170,SUM(AK170:AM170))","v":0},null,null,null,{"$f":"IF(AO170<Instructions!D197,AO170,SUM(AO170:AQ170))","v":0},"--",0,{"$f":"SUM(Table_2[[#This Row],[Column20]],Table_2[[#This Row],[Column19]],Table_2[[#This Row],[Column18]])","v":0},"HEALTH & PHY. EDU.",{"$f":"(M170/Instructions!$C$23)*100","v":0},{"$f":"(P170/Instructions!$C$24)*100","v":0},{"$f":"(S170/Instructions!$C$25)*100","v":0},{"$f":"(V170/Instructions!$C$26)*100","v":0},{"$f":"(Y170/Instructions!$C$27)*100","v":0},{"$f":"(AB170/Instructions!$C$28)*100","v":0},{"$f":"(AF170/Instructions!$C$29)*100","v":0},{"$f":"(AJ170/Instructions!$C$30)*100","v":0},{"$f":"(AN170/Instructions!$C$31)*100","v":0},0,{"$f":"(AS170/Instructions!$C$33)*100","v":{"$error":"#VALUE!"}},"----","E","E","E","E","E","E","E","E","E","E","--","E",null,null,null,null,{"$f":"Table_2[[#This Row],[Column51]]&Table_2[[#This Row],[Column52]]&BU172","v":""}]
[169,null,null,null,null,null,null,null,null,null,null,null,0,null,null,0,null,null,0,null,null,0,null,null,0,null,null,0,null,null,null,0,null,null,null,{"$f":"IF(AG171<Instructions!D200,AG171,SUM(AG171:AI171))","v":0},null,null,null,{"$f":"IF(AK171<Instructions!D199,AK171,SUM(AK171:AM171))","v":0},null,null,null,{"$f":"IF(AO171<Instructions!D198,AO171,SUM(AO171:AQ171))","v":0},"--",0,{"$f":"SUM(Table_2[[#This Row],[Column20]],Table_2[[#This Row],[Column19]],Table_2[[#This Row],[Column18]])","v":0},"HEALTH & PHY. EDU.",{"$f":"(M171/Instructions!$C$23)*100","v":0},{"$f":"(P171/Instructions!$C$24)*100","v":0},{"$f":"(S171/Instructions!$C$25)*100","v":0},{"$f":"(V171/Instructions!$C$26)*100","v":0},{"$f":"(Y171/Instructions!$C$27)*100","v":0},{"$f":"(AB171/Instructions!$C$28)*100","v":0},{"$f":"(AF171/Instructions!$C$29)*100","v":0},{"$f":"(AJ171/Instructions!$C$30)*100","v":0},{"$f":"(AN171/Instructions!$C$31)*100","v":0},0,{"$f":"(AS171/Instructions!$C$33)*100","v":{"$error":"#VALUE!"}},"----","E","E","E","E","E","E","E","E","E","E","--","E",null,null,null,null,{"$f":"Table_2[[#This Row],[Column51]]&Table_2[[#This Row],[Column52]]&BU173","v":""}]
[170,null,null,null,null,null,null,null,null,null,null,null,0,null,null,0,null,null,0,null,null,0,null,null,0,null,null,0,null,null,null,0,null,null,null,{"$f":"IF(AG172<Instructions!D201,AG172,SUM(AG172:AI172))","v":0},null,null,null,{"$f":"IF(AK172<Instructions!D200,AK172,SUM(AK172:AM172))","v":0},null,null,null,{"$f":"IF(AO172<Instructions!D199,AO172,SUM(AO172:AQ172))","v":0},"--",0,{"$f":"SUM(Table_2[[#This Row],[Column20]],Table_2[[#This Row],[Column19]],Table_2[[#This Row],[Column18]])","v":0},"HEALTH & PHY. EDU.",{"$f":"(M172/Instructions!$C$23)*100","v":0},{"$f":"(P172/Instructions!$C$24)*100","v":0},{"$f":"(S172/Instructions!$C$25)*100","v":0},{"$f":"(V172/Instructions!$C$26)*100","v":0},{"$f":"(Y172/Instructions!$C$27)*100","v":0},{"$f":"(AB172/Instructions!$C$28)*100","v":0},{"$f":"(AF172/Instructions!$C$29)*100","v":0},{"$f":"(AJ172/Instructions!$C$30)*100","v":0},{"$f":"(AN172/Instructions!$C$31)*100","v":0},0,{"$f":"(AS172/Instructions!$C$33)*100","v":{"$error":"#VALUE!"}},"----","E","E","E","E","E","E","E","E","E","E","--","E",null,null,null,null,{"$f":"Table_2[[#This Row],[Column51]]&Table_2[[#This Row],[Column52]]&BU174","v":""}]
[171,null,null,null,null,null,null,null,null,null,null,null,0,null,null,0,null,null,0,null,null,0,null,null,0,null,null,0,null,null,null,0,null,null,null,{"$f":"IF(AG173<Instructions!D202,AG173,SUM(AG173:AI173))","v":0},null,null,null,{"$f":"IF(AK173<Instructions!D201,AK173,SUM(AK173:AM173))","v":0},null,null,null,{"$f":"IF(AO173<Instructions!D200,AO173,SUM(AO173:AQ173))","v":0},"--",0,{"$f":"SUM(Table_2[[#This Row],[Column20]],Table_2[[#This Row],[Column19]],Table_2[[#This Row],[Column18]])","v":0},"HEALTH & PHY. EDU.",{"$f":"(M173/Instructions!$C$23)*100","v":0},{"$f":"(P173/Instructions!$C$24)*100","v":0},{"$f":"(S173/Instructions!$C$25)*100","v":0},{"$f":"(V173/Instructions!$C$26)*100","v":0},{"$f":"(Y173/Instructions!$C$27)*100","v":0},{"$f":"(AB173/Instructions!$C$28)*100","v":0},{"$f":"(AF173/Instructions!$C$29)*100","v":0},{"$f":"(AJ173/Instructions!$C$30)*100","v":0},{"$f":"(AN173/Instructions!$C$31)*100","v":0},0,{"$f":"(AS173/Instructions!$C$33)*100","v":{"$error":"#VALUE!"}},"----","E","E","E","E","E","E","E","E","E","E","--","E",null,null,null,null,{"$f":"Table_2[[#This Row],[Column51]]&Table_2[[#This Row],[Column52]]&BU175","v":""}]
[172,null,null,null,null,null,null,null,null,null,null,null,0,null,null,0,null,null,0,null,null,0,null,null,0,null,null,0,null,null,null,0,null,null,null,{"$f":"IF(AG174<Instructions!D203,AG174,SUM(AG174:AI174))","v":0},null,null,null,{"$f":"IF(AK174<Instructions!D202,AK174,SUM(AK174:AM174))","v":0},null,null,null,{"$f":"IF(AO174<Instructions!D201,AO174,SUM(AO174:AQ174))","v":0},"--",0,{"$f":"SUM(Table_2[[#This Row],[Column20]],Table_2[[#This Row],[Column19]],Table_2[[#This Row],[Column18]])","v":0},"HEALTH & PHY. EDU.",{"$f":"(M174/Instructions!$C$23)*100","v":0},{"$f":"(P174/Instructions!$C$24)*100","v":0},{"$f":"(S174/Instructions!$C$25)*100","v":0},{"$f":"(V174/Instructions!$C$26)*100","v":0},{"$f":"(Y174/Instructions!$C$27)*100","v":0},{"$f":"(AB174/Instructions!$C$28)*100","v":0},{"$f":"(AF174/Instructions!$C$29)*100","v":0},{"$f":"(AJ174/Instructions!$C$30)*100","v":0},{"$f":"(AN174/Instructions!$C$31)*100","v":0},0,{"$f":"(AS174/Instructions!$C$33)*100","v":{"$error":"#VALUE!"}},"----","E","E","E","E","E","E","E","E","E","E","--","E",null,null,null,null,{"$f":"Table_2[[#This Row],[Column51]]&Table_2[[#This Row],[Column52]]&BU176","v":""}]
[173,null,null,null,null,null,null,null,null,null,null,null,0,null,null,0,null,null,0,null,null,0,null,null,0,null,null,0,null,null,null,0,null,null,null,{"$f":"IF(AG175<Instructions!D204,AG175,SUM(AG175:AI175))","v":0},null,null,null,{"$f":"IF(AK175<Instructions!D203,AK175,SUM(AK175:AM175))","v":0},null,null,null,{"$f":"IF(AO175<Instructions!D202,AO175,SUM(AO175:AQ175))","v":0},"--",0,{"$f":"SUM(Table_2[[#This Row],[Column20]],Table_2[[#This Row],[Column19]],Table_2[[#This Row],[Column18]])","v":0},"HEALTH & PHY. EDU.",{"$f":"(M175/Instructions!$C$23)*100","v":0},{"$f":"(P175/Instructions!$C$24)*100","v":0},{"$f":"(S175/Instructions!$C$25)*100","v":0},{"$f":"(V175/Instructions!$C$26)*100","v":0},{"$f":"(Y175/Instructions!$C$27)*100","v":0},{"$f":"(AB175/Instructions!$C$28)*100","v":0},{"$f":"(AF175/Instructions!$C$29)*100","v":0},{"$f":"(AJ175/Instructions!$C$30)*100","v":0},{"$f":"(AN175/Instructions!$C$31)*100","v":0},0,{"$f":"(AS175/Instructions!$C$33)*100","v":{"$error":"#VALUE!"}},"----","E","E","E","E","E","E","E","E","E","E","--","E",null,null,null,null,{"$f":"Table_2[[#This Row],[Column51]]&Table_2[[#This Row],[Column52]]&BU177","v":""}]
[174,null,null,null,null,null,null,null,null,null,null,null,0,null,null,0,null,null,0,null,null,0,null,null,0,null,null,0,null,null,null,0,null,null,null,{"$f":"IF(AG176<Instructions!D205,AG176,SUM(AG176:AI176))","v":0},null,null,null,{"$f":"IF(AK176<Instructions!D204,AK176,SUM(AK176:AM176))","v":0},null,null,null,{"$f":"IF(AO176<Instructions!D203,AO176,SUM(AO176:AQ176))","v":0},"--",0,{"$f":"SUM(Table_2[[#This Row],[Column20]],Table_2[[#This Row],[Column19]],Table_2[[#This Row],[Column18]])","v":0},"HEALTH & PHY. EDU.",{"$f":"(M176/Instructions!$C$23)*100","v":0},{"$f":"(P176/Instructions!$C$24)*100","v":0},{"$f":"(S176/Instructions!$C$25)*100","v":0},{"$f":"(V176/Instructions!$C$26)*100","v":0},{"$f":"(Y176/Instructions!$C$27)*100","v":0},{"$f":"(AB176/Instructions!$C$28)*100","v":0},{"$f":"(AF176/Instructions!$C$29)*100","v":0},{"$f":"(AJ176/Instructions!$C$30)*100","v":0},{"$f":"(AN176/Instructions!$C$31)*100","v":0},0,{"$f":"(AS176/Instructions!$C$33)*100","v":{"$error":"#VALUE!"}},"----","E","E","E","E","E","E","E","E","E","E","--","E",null,null,null,null,{"$f":"Table_2[[#This Row],[Column51]]&Table_2[[#This Row],[Column52]]&BU178","v":""}]
[175,null,null,null,null,null,null,null,null,null,null,null,0,null,null,0,null,null,0,null,null,0,null,null,0,null,null,0,null,null,null,0,null,null,null,{"$f":"IF(AG177<Instructions!D206,AG177,SUM(AG177:AI177))","v":0},null,null,null,{"$f":"IF(AK177<Instructions!D205,AK177,SUM(AK177:AM177))","v":0},null,null,null,{"$f":"IF(AO177<Instructions!D204,AO177,SUM(AO177:AQ177))","v":0},"--",0,{"$f":"SUM(Table_2[[#This Row],[Column20]],Table_2[[#This Row],[Column19]],Table_2[[#This Row],[Column18]])","v":0},"HEALTH & PHY. EDU.",{"$f":"(M177/Instructions!$C$23)*100","v":0},{"$f":"(P177/Instructions!$C$24)*100","v":0},{"$f":"(S177/Instructions!$C$25)*100","v":0},{"$f":"(V177/Instructions!$C$26)*100","v":0},{"$f":"(Y177/Instructions!$C$27)*100","v":0},{"$f":"(AB177/Instructions!$C$28)*100","v":0},{"$f":"(AF177/Instructions!$C$29)*100","v":0},{"$f":"(AJ177/Instructions!$C$30)*100","v":0},{"$f":"(AN177/Instructions!$C$31)*100","v":0},0,{"$f":"(AS177/Instructions!$C$33)*100","v":{"$error":"#VALUE!"}},"----","E","E","E","E","E","E","E","E","E","E","--","E",null,null,null,null,{"$f":"Table_2[[#This Row],[Column51]]&Table_2[[#This Row],[Column52]]&BU179","v":""}]
[176,null,null,null,null,null,null,null,null,null,null,null,0,null,null,0,null,null,0,null,null,0,null,null,0,null,null,0,null,null,null,0,null,null,null,{"$f":"IF(AG178<Instructions!D207,AG178,SUM(AG178:AI178))","v":0},null,null,null,{"$f":"IF(AK178<Instructions!D206,AK178,SUM(AK178:AM178))","v":0},null,null,null,{"$f":"IF(AO178<Instructions!D205,AO178,SUM(AO178:AQ178))","v":0},"--",0,{"$f":"SUM(Table_2[[#This Row],[Column20]],Table_2[[#This Row],[Column19]],Table_2[[#This Row],[Column18]])","v":0},"HEALTH & PHY. EDU.",{"$f":"(M178/Instructions!$C$23)*100","v":0},{"$f":"(P178/Instructions!$C$24)*100","v":0},{"$f":"(S178/Instructions!$C$25)*100","v":0},{"$f":"(V178/Instructions!$C$26)*100","v":0},{"$f":"(Y178/Instructions!$C$27)*100","v":0},{"$f":"(AB178/Instructions!$C$28)*100","v":0},{"$f":"(AF178/Instructions!$C$29)*100","v":0},{"$f":"(AJ178/Instructions!$C$30)*100","v":0},{"$f":"(AN178/Instructions!$C$31)*100","v":0},0,{"$f":"(AS178/Instructions!$C$33)*100","v":{"$error":"#VALUE!"}},"----","E","E","E","E","E","E","E","E","E","E","--","E",null,null,null,null,{"$f":"Table_2[[#This Row],[Column51]]&Table_2[[#This Row],[Column52]]&BU180","v":""}]
[177,null,null,null,null,null,null,null,null,null,null,null,0,null,null,0,null,null,0,null,null,0,null,null,0,null,null,0,null,null,null,0,null,null,null,{"$f":"IF(AG179<Instructions!D208,AG179,SUM(AG179:AI179))","v":0},null,null,null,{"$f":"IF(AK179<Instructions!D207,AK179,SUM(AK179:AM179))","v":0},null,null,null,{"$f":"IF(AO179<Instructions!D206,AO179,SUM(AO179:AQ179))","v":0},"--",0,{"$f":"SUM(Table_2[[#This Row],[Column20]],Table_2[[#This Row],[Column19]],Table_2[[#This Row],[Column18]])","v":0},"HEALTH & PHY. EDU.",{"$f":"(M179/Instructions!$C$23)*100","v":0},{"$f":"(P179/Instructions!$C$24)*100","v":0},{"$f":"(S179/Instructions!$C$25)*100","v":0},{"$f":"(V179/Instructions!$C$26)*100","v":0},{"$f":"(Y179/Instructions!$C$27)*100","v":0},{"$f":"(AB179/Instructions!$C$28)*100","v":0},{"$f":"(AF179/Instructions!$C$29)*100","v":0},{"$f":"(AJ179/Instructions!$C$30)*100","v":0},{"$f":"(AN179/Instructions!$C$31)*100","v":0},0,{"$f":"(AS179/Instructions!$C$33)*100","v":{"$error":"#VALUE!"}},"----","E","E","E","E","E","E","E","E","E","E","--","E",null,null,null,null,{"$f":"Table_2[[#This Row],[Column51]]&Table_2[[#This Row],[Column52]]&BU181","v":""}]
[178,null,null,null,null,null,null,null,null,null,null,null,0,null,null,0,null,null,0,null,null,0,null,null,0,null,null,0,null,null,null,0,null,null,null,{"$f":"IF(AG180<Instructions!D209,AG180,SUM(AG180:AI180))","v":0},null,null,null,{"$f":"IF(AK180<Instructions!D208,AK180,SUM(AK180:AM180))","v":0},null,null,null,{"$f":"IF(AO180<Instructions!D207,AO180,SUM(AO180:AQ180))","v":0},"--",0,{"$f":"SUM(Table_2[[#This Row],[Column20]],Table_2[[#This Row],[Column19]],Table_2[[#This Row],[Column18]])","v":0},"HEALTH & PHY. EDU.",{"$f":"(M180/Instructions!$C$23)*100","v":0},{"$f":"(P180/Instructions!$C$24)*100","v":0},{"$f":"(S180/Instructions!$C$25)*100","v":0},{"$f":"(V180/Instructions!$C$26)*100","v":0},{"$f":"(Y180/Instructions!$C$27)*100","v":0},{"$f":"(AB180/Instructions!$C$28)*100","v":0},{"$f":"(AF180/Instructions!$C$29)*100","v":0},{"$f":"(AJ180/Instructions!$C$30)*100","v":0},{"$f":"(AN180/Instructions!$C$31)*100","v":0},0,{"$f":"(AS180/Instructions!$C$33)*100","v":{"$error":"#VALUE!"}},"----","E","E","E","E","E","E","E","E","E","E","--","E",null,null,null,null,{"$f":"Table_2[[#This Row],[Column51]]&Table_2[[#This Row],[Column52]]&BU182","v":""}]
[179,null,null,null,null,null,null,null,null,null,null,null,0,null,null,0,null,null,0,null,null,0,null,null,0,null,null,0,null,null,null,0,null,null,null,{"$f":"IF(AG181<Instructions!D210,AG181,SUM(AG181:AI181))","v":0},null,null,null,{"$f":"IF(AK181<Instructions!D209,AK181,SUM(AK181:AM181))","v":0},null,null,null,{"$f":"IF(AO181<Instructions!D208,AO181,SUM(AO181:AQ181))","v":0},"--",0,{"$f":"SUM(Table_2[[#This Row],[Column20]],Table_2[[#This Row],[Column19]],Table_2[[#This Row],[Column18]])","v":0},"HEALTH & PHY. EDU.",{"$f":"(M181/Instructions!$C$23)*100","v":0},{"$f":"(P181/Instructions!$C$24)*100","v":0},{"$f":"(S181/Instructions!$C$25)*100","v":0},{"$f":"(V181/Instructions!$C$26)*100","v":0},{"$f":"(Y181/Instructions!$C$27)*100","v":0},{"$f":"(AB181/Instructions!$C$28)*100","v":0},{"$f":"(AF181/Instructions!$C$29)*100","v":0},{"$f":"(AJ181/Instructions!$C$30)*100","v":0},{"$f":"(AN181/Instructions!$C$31)*100","v":0},0,{"$f":"(AS181/Instructions!$C$33)*100","v":{"$error":"#VALUE!"}},"----","E","E",{"$f":"IFERROR(IF(AY181>90,\"A+\",IF(AY181>80,\"A\",IF(AY181>70,\"B+\",IF(AY181>60,\"B\",IF(AY181>50,\"C+\",IF(AY181>40,\"C\",IF(AY181>=33,\"D\",\"E\"))))))),\"Abs\")","v":"E"},{"$f":"IFERROR(IF(AZ181>90,\"A+\",IF(AZ181>80,\"A\",IF(AZ181>70,\"B+\",IF(AZ181>60,\"B\",IF(AZ181>50,\"C+\",IF(AZ181>40,\"C\",IF(AZ181>=33,\"D\",\"E\"))))))),\"Abs\")","v":"E"},{"$f":"IFERROR(IF(BA181>90,\"A+\",IF(BA181>80,\"A\",IF(BA181>70,\"B+\",IF(BA181>60,\"B\",IF(BA181>50,\"C+\",IF(BA181>40,\"C\",IF(BA181>=33,\"D\",\"E\"))))))),\"Abs\")","v":"E"},{"$f":"IFERROR(IF(BB181>90,\"A+\",IF(BB181>80,\"A\",IF(BB181>70,\"B+\",IF(BB181>60,\"B\",IF(BB181>50,\"C+\",IF(BB181>40,\"C\",IF(BB181>=33,\"D\",\"E\"))))))),\"Abs\")","v":"E"},{"$f":"IFERROR(IF(BC181>90,\"A+\",IF(BC181>80,\"A\",IF(BC181>70,\"B+\",IF(BC181>60,\"B\",IF(BC181>50,\"C+\",IF(BC181>40,\"C\",IF(BC181>=33,\"D\",\"E\"))))))),\"Abs\")","v":"E"},{"$f":"IFERROR(IF(BD181>90,\"A+\",IF(BD181>80,\"A\",IF(BD181>70,\"B+\",IF(BD181>60,\"B\",IF(BD181>50,\"C+\",IF(BD181>40,\"C\",IF(BD181>=33,\"D\",\"E\"))))))),\"Abs\")","v":"E"},{"$f":"IFERROR(IF(BE181>90,\"A+\",IF(BE181>80,\"A\",IF(BE181>70,\"B+\",IF(BE181>60,\"B\",IF(BE181>50,\"C+\",IF(BE181>40,\"C\",IF(BE181>=33,\"D\",\"E\"))))))),\"Abs\")","v":"E"},{"$f":"IFERROR(IF(BF181>90,\"A+\",IF(BF181>80,\"A\",IF(BF181>70,\"B+\",IF(BF181>60,\"B\",IF(BF181>50,\"C+\",IF(BF181>40,\"C\",IF(BF181>=33,\"D\",\"E\"))))))),\"Abs\")","v":"E"},"--","E",null,null,null,null,{"$f":"Table_2[[#This Row],[Column51]]&Table_2[[#This Row],[Column52]]&BU183","v":""}]
[180,null,null,null,null,null,null,null,null,null,null,null,0,null,null,0,null,null,0,null,null,0,null,null,0,null,null,0,null,null,null,0,null,null,null,{"$f":"IF(AG182<Instructions!D211,AG182,SUM(AG182:AI182))","v":0},null,null,null,{"$f":"IF(AK182<Instructions!D210,AK182,SUM(AK182:AM182))","v":0},null,null,null,{"$f":"IF(AO182<Instructions!D209,AO182,SUM(AO182:AQ182))","v":0},"--",0,{"$f":"SUM(Table_2[[#This Row],[Column20]],Table_2[[#This Row],[Column19]],Table_2[[#This Row],[Column18]])","v":0},"HEALTH & PHY. EDU.",{"$f":"(M182/Instructions!$C$23)*100","v":0},{"$f":"(P182/Instructions!$C$24)*100","v":0},{"$f":"(S182/Instructions!$C$25)*100","v":0},{"$f":"(V182/Instructions!$C$26)*100","v":0},{"$f":"(Y182/Instructions!$C$27)*100","v":0},{"$f":"(AB182/Instructions!$C$28)*100","v":0},{"$f":"(AF182/Instructions!$C$29)*100","v":0},{"$f":"(AJ182/Instructions!$C$30)*100","v":0},{"$f":"(AN182/Instructions!$C$31)*100","v":0},0,{"$f":"(AS182/Instructions!$C$33)*100","v":{"$error":"#VALUE!"}},"----","E","E","E","E","E","E","E","E","E","E","--","E",null,null,null,null,{"$f":"Table_2[[#This Row],[Column51]]&Table_2[[#This Row],[Column52]]&BU184","v":""}]
[181,null,null,null,null,null,null,null,null,null,null,null,0,null,null,0,null,null,0,null,null,0,null,null,0,null,null,0,null,null,null,0,null,null,null,{"$f":"IF(AG183<Instructions!D212,AG183,SUM(AG183:AI183))","v":0},null,null,null,{"$f":"IF(AK183<Instructions!D211,AK183,SUM(AK183:AM183))","v":0},null,null,null,{"$f":"IF(AO183<Instructions!D210,AO183,SUM(AO183:AQ183))","v":0},"--",0,{"$f":"SUM(Table_2[[#This Row],[Column20]],Table_2[[#This Row],[Column19]],Table_2[[#This Row],[Column18]])","v":0},"HEALTH & PHY. EDU.",{"$f":"(M183/Instructions!$C$23)*100","v":0},{"$f":"(P183/Instructions!$C$24)*100","v":0},{"$f":"(S183/Instructions!$C$25)*100","v":0},{"$f":"(V183/Instructions!$C$26)*100","v":0},{"$f":"(Y183/Instructions!$C$27)*100","v":0},{"$f":"(AB183/Instructions!$C$28)*100","v":0},{"$f":"(AF183/Instructions!$C$29)*100","v":0},{"$f":"(AJ183/Instructions!$C$30)*100","v":0},{"$f":"(AN183/Instructions!$C$31)*100","v":0},0,{"$f":"(AS183/Instructions!$C$33)*100","v":{"$error":"#VALUE!"}},"----","E","E","E","E","E","E","E","E","E","E","--","E",null,null,null,null,{"$f":"Table_2[[#This Row],[Column51]]&Table_2[[#This Row],[Column52]]&BU185","v":""}]
[182,null,null,null,null,null,null,null,null,null,null,null,0,null,null,0,null,null,0,null,null,0,null,null,0,null,null,0,null,null,null,0,null,null,null,{"$f":"IF(AG184<Instructions!D213,AG184,SUM(AG184:AI184))","v":0},null,null,null,{"$f":"IF(AK184<Instructions!D212,AK184,SUM(AK184:AM184))","v":0},null,null,null,{"$f":"IF(AO184<Instructions!D211,AO184,SUM(AO184:AQ184))","v":0},"--",0,{"$f":"SUM(Table_2[[#This Row],[Column20]],Table_2[[#This Row],[Column19]],Table_2[[#This Row],[Column18]])","v":0},"HEALTH & PHY. EDU.",{"$f":"(M184/Instructions!$C$23)*100","v":0},{"$f":"(P184/Instructions!$C$24)*100","v":0},{"$f":"(S184/Instructions!$C$25)*100","v":0},{"$f":"(V184/Instructions!$C$26)*100","v":0},{"$f":"(Y184/Instructions!$C$27)*100","v":0},{"$f":"(AB184/Instructions!$C$28)*100","v":0},{"$f":"(AF184/Instructions!$C$29)*100","v":0},{"$f":"(AJ184/Instructions!$C$30)*100","v":0},{"$f":"(AN184/Instructions!$C$31)*100","v":0},0,{"$f":"(AS184/Instructions!$C$33)*100","v":{"$error":"#VALUE!"}},"----","E","E","E","E","E","E","E","E","E","E","--","E",null,null,null,null,{"$f":"Table_2[[#This Row],[Column51]]&Table_2[[#This Row],[Column52]]&BU186","v":""}]
[183,null,null,null,null,null,null,null,null,null,null,null,0,null,null,0,null,null,0,null,null,0,null,null,0,null,null,0,null,null,null,0,null,null,null,{"$f":"IF(AG185<Instructions!D214,AG185,SUM(AG185:AI185))","v":0},null,null,null,{"$f":"IF(AK185<Instructions!D213,AK185,SUM(AK185:AM185))","v":0},null,null,null,{"$f":"IF(AO185<Instructions!D212,AO185,SUM(AO185:AQ185))","v":0},"--",0,{"$f":"SUM(Table_2[[#This Row],[Column20]],Table_2[[#This Row],[Column19]],Table_2[[#This Row],[Column18]])","v":0},"HEALTH & PHY. EDU.",{"$f":"(M185/Instructions!$C$23)*100","v":0},{"$f":"(P185/Instructions!$C$24)*100","v":0},{"$f":"(S185/Instructions!$C$25)*100","v":0},{"$f":"(V185/Instructions!$C$26)*100","v":0},{"$f":"(Y185/Instructions!$C$27)*100","v":0},{"$f":"(AB185/Instructions!$C$28)*100","v":0},{"$f":"(AF185/Instructions!$C$29)*100","v":0},{"$f":"(AJ185/Instructions!$C$30)*100","v":0},{"$f":"(AN185/Instructions!$C$31)*100","v":0},0,{"$f":"(AS185/Instructions!$C$33)*100","v":{"$error":"#VALUE!"}},"----","E","E","E","E","E","E","E","E","E","E","--","E",null,null,null,null,{"$f":"Table_2[[#This Row],[Column51]]&Table_2[[#This Row],[Column52]]&BU187","v":""}]
[184,null,null,null,null,null,null,null,null,null,null,null,0,null,null,0,null,null,0,null,null,0,null,null,0,null,null,0,null,null,null,0,null,null,null,{"$f":"IF(AG186<Instructions!D215,AG186,SUM(AG186:AI186))","v":0},null,null,null,{"$f":"IF(AK186<Instructions!D214,AK186,SUM(AK186:AM186))","v":0},null,null,null,{"$f":"IF(AO186<Instructions!D213,AO186,SUM(AO186:AQ186))","v":0},"--",0,{"$f":"SUM(Table_2[[#This Row],[Column20]],Table_2[[#This Row],[Column19]],Table_2[[#This Row],[Column18]])","v":0},"HEALTH & PHY. EDU.",{"$f":"(M186/Instructions!$C$23)*100","v":0},{"$f":"(P186/Instructions!$C$24)*100","v":0},{"$f":"(S186/Instructions!$C$25)*100","v":0},{"$f":"(V186/Instructions!$C$26)*100","v":0},{"$f":"(Y186/Instructions!$C$27)*100","v":0},{"$f":"(AB186/Instructions!$C$28)*100","v":0},{"$f":"(AF186/Instructions!$C$29)*100","v":0},{"$f":"(AJ186/Instructions!$C$30)*100","v":0},{"$f":"(AN186/Instructions!$C$31)*100","v":0},0,{"$f":"(AS186/Instructions!$C$33)*100","v":{"$error":"#VALUE!"}},"----","E","E","E","E","E","E","E","E","E","E","--","E",null,null,null,null,{"$f":"Table_2[[#This Row],[Column51]]&Table_2[[#This Row],[Column52]]&BU188","v":""}]
[185,null,null,null,null,null,null,null,null,null,null,null,0,null,null,0,null,null,0,null,null,0,null,null,0,null,null,0,null,null,null,0,null,null,null,{"$f":"IF(AG187<Instructions!D216,AG187,SUM(AG187:AI187))","v":0},null,null,null,{"$f":"IF(AK187<Instructions!D215,AK187,SUM(AK187:AM187))","v":0},null,null,null,{"$f":"IF(AO187<Instructions!D214,AO187,SUM(AO187:AQ187))","v":0},"--",0,{"$f":"SUM(Table_2[[#This Row],[Column20]],Table_2[[#This Row],[Column19]],Table_2[[#This Row],[Column18]])","v":0},"HEALTH & PHY. EDU.",{"$f":"(M187/Instructions!$C$23)*100","v":0},{"$f":"(P187/Instructions!$C$24)*100","v":0},{"$f":"(S187/Instructions!$C$25)*100","v":0},{"$f":"(V187/Instructions!$C$26)*100","v":0},{"$f":"(Y187/Instructions!$C$27)*100","v":0},{"$f":"(AB187/Instructions!$C$28)*100","v":0},{"$f":"(AF187/Instructions!$C$29)*100","v":0},{"$f":"(AJ187/Instructions!$C$30)*100","v":0},{"$f":"(AN187/Instructions!$C$31)*100","v":0},0,{"$f":"(AS187/Instructions!$C$33)*100","v":{"$error":"#VALUE!"}},"----","E","E","E","E","E","E","E","E","E","E","--","E",null,null,null,null,{"$f":"Table_2[[#This Row],[Column51]]&Table_2[[#This Row],[Column52]]&BU189","v":""}]
[186,null,null,null,null,null,null,null,null,null,null,null,0,null,null,0,null,null,0,null,null,0,null,null,0,null,null,0,null,null,null,0,null,null,null,{"$f":"IF(AG188<Instructions!D217,AG188,SUM(AG188:AI188))","v":0},null,null,null,{"$f":"IF(AK188<Instructions!D216,AK188,SUM(AK188:AM188))","v":0},null,null,null,{"$f":"IF(AO188<Instructions!D215,AO188,SUM(AO188:AQ188))","v":0},"--",0,{"$f":"SUM(Table_2[[#This Row],[Column20]],Table_2[[#This Row],[Column19]],Table_2[[#This Row],[Column18]])","v":0},"HEALTH & PHY. EDU.",{"$f":"(M188/Instructions!$C$23)*100","v":0},{"$f":"(P188/Instructions!$C$24)*100","v":0},{"$f":"(S188/Instructions!$C$25)*100","v":0},{"$f":"(V188/Instructions!$C$26)*100","v":0},{"$f":"(Y188/Instructions!$C$27)*100","v":0},{"$f":"(AB188/Instructions!$C$28)*100","v":0},{"$f":"(AF188/Instructions!$C$29)*100","v":0},{"$f":"(AJ188/Instructions!$C$30)*100","v":0},{"$f":"(AN188/Instructions!$C$31)*100","v":0},0,{"$f":"(AS188/Instructions!$C$33)*100","v":{"$error":"#VALUE!"}},"----","E","E","E","E","E","E","E","E","E","E","--","E",null,null,null,null,{"$f":"Table_2[[#This Row],[Column51]]&Table_2[[#This Row],[Column52]]&BU190","v":""}]
[187,null,null,null,null,null,null,null,null,null,null,null,0,null,null,0,null,null,0,null,null,0,null,null,0,null,null,0,null,null,null,0,null,null,null,{"$f":"IF(AG189<Instructions!D218,AG189,SUM(AG189:AI189))","v":0},null,null,null,{"$f":"IF(AK189<Instructions!D217,AK189,SUM(AK189:AM189))","v":0},null,null,null,{"$f":"IF(AO189<Instructions!D216,AO189,SUM(AO189:AQ189))","v":0},"--",0,{"$f":"SUM(Table_2[[#This Row],[Column20]],Table_2[[#This Row],[Column19]],Table_2[[#This Row],[Column18]])","v":0},"HEALTH & PHY. EDU.",{"$f":"(M189/Instructions!$C$23)*100","v":0},{"$f":"(P189/Instructions!$C$24)*100","v":0},{"$f":"(S189/Instructions!$C$25)*100","v":0},{"$f":"(V189/Instructions!$C$26)*100","v":0},{"$f":"(Y189/Instructions!$C$27)*100","v":0},{"$f":"(AB189/Instructions!$C$28)*100","v":0},{"$f":"(AF189/Instructions!$C$29)*100","v":0},{"$f":"(AJ189/Instructions!$C$30)*100","v":0},{"$f":"(AN189/Instructions!$C$31)*100","v":0},0,{"$f":"(AS189/Instructions!$C$33)*100","v":{"$error":"#VALUE!"}},"----","E","E","E","E","E","E","E","E","E","E","--","E",null,null,null,null,{"$f":"Table_2[[#This Row],[Column51]]&Table_2[[#This Row],[Column52]]&BU191","v":""}]
[188,null,null,null,null,null,null,null,null,null,null,null,0,null,null,0,null,null,0,null,null,0,null,null,0,null,null,0,null,null,null,0,null,null,null,{"$f":"IF(AG190<Instructions!D219,AG190,SUM(AG190:AI190))","v":0},null,null,null,{"$f":"IF(AK190<Instructions!D218,AK190,SUM(AK190:AM190))","v":0},null,null,null,{"$f":"IF(AO190<Instructions!D217,AO190,SUM(AO190:AQ190))","v":0},"--",0,{"$f":"SUM(Table_2[[#This Row],[Column20]],Table_2[[#This Row],[Column19]],Table_2[[#This Row],[Column18]])","v":0},"HEALTH & PHY. EDU.",{"$f":"(M190/Instructions!$C$23)*100","v":0},{"$f":"(P190/Instructions!$C$24)*100","v":0},{"$f":"(S190/Instructions!$C$25)*100","v":0},{"$f":"(V190/Instructions!$C$26)*100","v":0},{"$f":"(Y190/Instructions!$C$27)*100","v":0},{"$f":"(AB190/Instructions!$C$28)*100","v":0},{"$f":"(AF190/Instructions!$C$29)*100","v":0},{"$f":"(AJ190/Instructions!$C$30)*100","v":0},{"$f":"(AN190/Instructions!$C$31)*100","v":0},0,{"$f":"(AS190/Instructions!$C$33)*100","v":{"$error":"#VALUE!"}},"----","E","E","E","E","E","E","E","E","E","E","--","E",null,null,null,null,{"$f":"Table_2[[#This Row],[Column51]]&Table_2[[#This Row],[Column52]]&BU192","v":""}]
[189,null,null,null,null,null,null,null,null,null,null,null,0,null,null,0,null,null,0,null,null,0,null,null,0,null,null,0,null,null,null,0,null,null,null,{"$f":"IF(AG191<Instructions!D220,AG191,SUM(AG191:AI191))","v":0},null,null,null,{"$f":"IF(AK191<Instructions!D219,AK191,SUM(AK191:AM191))","v":0},null,null,null,{"$f":"IF(AO191<Instructions!D218,AO191,SUM(AO191:AQ191))","v":0},"--",0,{"$f":"SUM(Table_2[[#This Row],[Column20]],Table_2[[#This Row],[Column19]],Table_2[[#This Row],[Column18]])","v":0},"HEALTH & PHY. EDU.",{"$f":"(M191/Instructions!$C$23)*100","v":0},{"$f":"(P191/Instructions!$C$24)*100","v":0},{"$f":"(S191/Instructions!$C$25)*100","v":0},{"$f":"(V191/Instructions!$C$26)*100","v":0},{"$f":"(Y191/Instructions!$C$27)*100","v":0},{"$f":"(AB191/Instructions!$C$28)*100","v":0},{"$f":"(AF191/Instructions!$C$29)*100","v":0},{"$f":"(AJ191/Instructions!$C$30)*100","v":0},{"$f":"(AN191/Instructions!$C$31)*100","v":0},0,{"$f":"(AS191/Instructions!$C$33)*100","v":{"$error":"#VALUE!"}},"----","E","E","E","E","E","E","E","E","E","E","--","E",null,null,null,null,{"$f":"Table_2[[#This Row],[Column51]]&Table_2[[#This Row],[Column52]]&BU193","v":""}]
[190,null,null,null,null,null,null,null,null,null,null,null,0,null,null,0,null,null,0,null,null,0,null,null,0,null,null,0,null,null,null,0,null,null,null,{"$f":"IF(AG192<Instructions!D221,AG192,SUM(AG192:AI192))","v":0},null,null,null,{"$f":"IF(AK192<Instructions!D220,AK192,SUM(AK192:AM192))","v":0},null,null,null,{"$f":"IF(AO192<Instructions!D219,AO192,SUM(AO192:AQ192))","v":0},"--",0,{"$f":"SUM(Table_2[[#This Row],[Column20]],Table_2[[#This Row],[Column19]],Table_2[[#This Row],[Column18]])","v":0},"HEALTH & PHY. EDU.",{"$f":"(M192/Instructions!$C$23)*100","v":0},{"$f":"(P192/Instructions!$C$24)*100","v":0},{"$f":"(S192/Instructions!$C$25)*100","v":0},{"$f":"(V192/Instructions!$C$26)*100","v":0},{"$f":"(Y192/Instructions!$C$27)*100","v":0},{"$f":"(AB192/Instructions!$C$28)*100","v":0},{"$f":"(AF192/Instructions!$C$29)*100","v":0},{"$f":"(AJ192/Instructions!$C$30)*100","v":0},{"$f":"(AN192/Instructions!$C$31)*100","v":0},0,{"$f":"(AS192/Instructions!$C$33)*100","v":{"$error":"#VALUE!"}},"----","E","E","E","E","E","E","E","E","E","E","--","E",null,null,null,null,{"$f":"Table_2[[#This Row],[Column51]]&Table_2[[#This Row],[Column52]]&BU194","v":""}]
[191,null,null,null,null,null,null,null,null,null,null,null,0,null,null,0,null,null,0,null,null,0,null,null,0,null,null,0,null,null,null,0,null,null,null,{"$f":"IF(AG193<Instructions!D222,AG193,SUM(AG193:AI193))","v":0},null,null,null,{"$f":"IF(AK193<Instructions!D221,AK193,SUM(AK193:AM193))","v":0},null,null,null,{"$f":"IF(AO193<Instructions!D220,AO193,SUM(AO193:AQ193))","v":0},"--",0,{"$f":"SUM(Table_2[[#This Row],[Column20]],Table_2[[#This Row],[Column19]],Table_2[[#This Row],[Column18]])","v":0},"HEALTH & PHY. EDU.",{"$f":"(M193/Instructions!$C$23)*100","v":0},{"$f":"(P193/Instructions!$C$24)*100","v":0},{"$f":"(S193/Instructions!$C$25)*100","v":0},{"$f":"(V193/Instructions!$C$26)*100","v":0},{"$f":"(Y193/Instructions!$C$27)*100","v":0},{"$f":"(AB193/Instructions!$C$28)*100","v":0},{"$f":"(AF193/Instructions!$C$29)*100","v":0},{"$f":"(AJ193/Instructions!$C$30)*100","v":0},{"$f":"(AN193/Instructions!$C$31)*100","v":0},0,{"$f":"(AS193/Instructions!$C$33)*100","v":{"$error":"#VALUE!"}},"----","E","E","E","E","E","E","E","E","E","E","--","E",null,null,null,null,{"$f":"Table_2[[#This Row],[Column51]]&Table_2[[#This Row],[Column52]]&BU195","v":""}]
[192,null,null,null,null,null,null,null,null,null,null,null,0,null,null,0,null,null,0,null,null,0,null,null,0,null,null,0,null,null,null,0,null,null,null,{"$f":"IF(AG194<Instructions!D223,AG194,SUM(AG194:AI194))","v":0},null,null,null,{"$f":"IF(AK194<Instructions!D222,AK194,SUM(AK194:AM194))","v":0},null,null,null,{"$f":"IF(AO194<Instructions!D221,AO194,SUM(AO194:AQ194))","v":0},"--",0,{"$f":"SUM(Table_2[[#This Row],[Column20]],Table_2[[#This Row],[Column19]],Table_2[[#This Row],[Column18]])","v":0},"HEALTH & PHY. EDU.",{"$f":"(M194/Instructions!$C$23)*100","v":0},{"$f":"(P194/Instructions!$C$24)*100","v":0},{"$f":"(S194/Instructions!$C$25)*100","v":0},{"$f":"(V194/Instructions!$C$26)*100","v":0},{"$f":"(Y194/Instructions!$C$27)*100","v":0},{"$f":"(AB194/Instructions!$C$28)*100","v":0},{"$f":"(AF194/Instructions!$C$29)*100","v":0},{"$f":"(AJ194/Instructions!$C$30)*100","v":0},{"$f":"(AN194/Instructions!$C$31)*100","v":0},0,{"$f":"(AS194/Instructions!$C$33)*100","v":{"$error":"#VALUE!"}},"----","E","E","E","E","E","E","E","E","E","E","--","E",null,null,null,null,{"$f":"Table_2[[#This Row],[Column51]]&Table_2[[#This Row],[Column52]]&BU196","v":""}]
[193,null,null,null,null,null,null,null,null,null,null,null,0,null,null,0,null,null,0,null,null,0,null,null,0,null,null,0,null,null,null,0,null,null,null,{"$f":"IF(AG195<Instructions!D224,AG195,SUM(AG195:AI195))","v":0},null,null,null,{"$f":"IF(AK195<Instructions!D223,AK195,SUM(AK195:AM195))","v":0},null,null,null,{"$f":"IF(AO195<Instructions!D222,AO195,SUM(AO195:AQ195))","v":0},"--",0,{"$f":"SUM(Table_2[[#This Row],[Column20]],Table_2[[#This Row],[Column19]],Table_2[[#This Row],[Column18]])","v":0},"HEALTH & PHY. EDU.",{"$f":"(M195/Instructions!$C$23)*100","v":0},{"$f":"(P195/Instructions!$C$24)*100","v":0},{"$f":"(S195/Instructions!$C$25)*100","v":0},{"$f":"(V195/Instructions!$C$26)*100","v":0},{"$f":"(Y195/Instructions!$C$27)*100","v":0},{"$f":"(AB195/Instructions!$C$28)*100","v":0},{"$f":"(AF195/Instructions!$C$29)*100","v":0},{"$f":"(AJ195/Instructions!$C$30)*100","v":0},{"$f":"(AN195/Instructions!$C$31)*100","v":0},0,{"$f":"(AS195/Instructions!$C$33)*100","v":{"$error":"#VALUE!"}},"----","E","E","E","E","E","E","E","E","E","E","--","E",null,null,null,null,{"$f":"Table_2[[#This Row],[Column51]]&Table_2[[#This Row],[Column52]]&BU197","v":""}]
[194,null,null,null,null,null,null,null,null,null,null,null,{"$f":"IF(K196<33,K196,SUM(K196:L196))","v":0},null,null,{"$f":"IF(N196<20,N196,SUM(N196:O196))","v":0},null,null,{"$f":"IF(Q196<20,Q196,SUM(Q196:R196))","v":0},null,null,{"$f":"IF(T196<20,T196,SUM(T196:U196))","v":0},null,null,{"$f":"IF(W196<20,W196,SUM(W196:X196))","v":0},null,null,{"$f":"IF(Z196<20,Z196,SUM(Z196:AA196))","v":0},null,null,null,{"$f":"IF(AC196<10,AC196,SUM(AC196:AE196))","v":0},null,null,null,{"$f":"IF(AG196<Instructions!D225,AG196,SUM(AG196:AI196))","v":0},null,null,null,{"$f":"IF(AK196<Instructions!D224,AK196,SUM(AK196:AM196))","v":0},null,null,null,{"$f":"IF(AO196<Instructions!D223,AO196,SUM(AO196:AQ196))","v":0},{"$f":"IF(MIN(M196,P196,S196,V196,Y196,AB196)>=33,SUM(M196,P196,S196,V196,Y196,AB196),\"--\")","v":"--"},{"$f":"IF(AS196=\"--\",0,AS196)","v":0},{"$f":"SUM(Table_2[[#This Row],[Column20]],Table_2[[#This Row],[Column19]],Table_2[[#This Row],[Column18]])","v":0},{"$f":"IF(N(AJ196)>0,$AG$1,IF(N(AN196)>0,$AK$1,$AO$1))","v":"HEALTH & PHY. EDU."},{"$f":"(M196/Instructions!$C$23)*100","v":0},{"$f":"(P196/Instructions!$C$24)*100","v":0},{"$f":"(S196/Instructions!$C$25)*100","v":0},{"$f":"(V196/Instructions!$C$26)*100","v":0},{"$f":"(Y196/Instructions!$C$27)*100","v":0},{"$f":"(AB196/Instructions!$C$28)*100","v":0},{"$f":"(AF196/Instructions!$C$29)*100","v":0},{"$f":"(AJ196/Instructions!$C$30)*100","v":0},{"$f":"(AN196/Instructions!$C$31)*100","v":0},{"$f":"(AR196/100)*100","v":0},{"$f":"(AS196/Instructions!$C$33)*100","v":{"$error":"#VALUE!"}},{"$f":"IF(AND(AW196>=33,AX196>=33,AY196>=33,AZ196>=33,BA196>=33,BB196>=33),\"PASS\",\"----\")","v":"----"},"E","E","E","E","E","E","E","E","E","E",{"$f":"IFERROR(IF(BG196>90,\"A+\",IF(BG196>80,\"A\",IF(BG196>70,\"B+\",IF(BG196>60,\"B\",IF(BG196>50,\"C+\",IF(BG196>40,\"C\",IF(BG196>=33,\"D\",\"E\"))))))),\"--\")","v":"--"},{"$f":"IFERROR(IF(BF196>90,\"A+\",IF(BF196>80,\"A\",IF(BF196>70,\"B+\",IF(BF196>60,\"B\",IF(BF196>50,\"C+\",IF(BF196>40,\"C\",IF(BF196>=33,\"D\",\"E\"))))))),\"Abs\")","v":"E"},null,null,null,null,{"$f":"Table_2[[#This Row],[Column51]]&Table_2[[#This Row],[Column52]]&BU198","v":""}]
[195,null,null,null,null,null,null,null,null,null,null,null,0,null,null,0,null,null,0,null,null,0,null,null,0,null,null,0,null,null,null,0,null,null,null,{"$f":"IF(AG197<Instructions!D226,AG197,SUM(AG197:AI197))","v":0},null,null,null,{"$f":"IF(AK197<Instructions!D225,AK197,SUM(AK197:AM197))","v":0},null,null,null,{"$f":"IF(AO197<Instructions!D224,AO197,SUM(AO197:AQ197))","v":0},"--",0,{"$f":"SUM(Table_2[[#This Row],[Column20]],Table_2[[#This Row],[Column19]],Table_2[[#This Row],[Column18]])","v":0},"HEALTH & PHY. EDU.",{"$f":"(M197/Instructions!$C$23)*100","v":0},{"$f":"(P197/Instructions!$C$24)*100","v":0},{"$f":"(S197/Instructions!$C$25)*100","v":0},{"$f":"(V197/Instructions!$C$26)*100","v":0},{"$f":"(Y197/Instructions!$C$27)*100","v":0},{"$f":"(AB197/Instructions!$C$28)*100","v":0},{"$f":"(AF197/Instructions!$C$29)*100","v":0},{"$f":"(AJ197/Instructions!$C$30)*100","v":0},{"$f":"(AN197/Instructions!$C$31)*100","v":0},0,{"$f":"(AS197/Instructions!$C$33)*100","v":{"$error":"#VALUE!"}},"----","E","E","E","E","E","E","E","E","E","E","--","E",null,null,null,null,{"$f":"Table_2[[#This Row],[Column51]]&Table_2[[#This Row],[Column52]]&BU199","v":""}]
[196,null,null,null,null,null,null,null,null,null,null,null,0,null,null,0,null,null,0,null,null,0,null,null,0,null,null,0,null,null,null,0,null,null,null,{"$f":"IF(AG198<Instructions!D227,AG198,SUM(AG198:AI198))","v":0},null,null,null,{"$f":"IF(AK198<Instructions!D226,AK198,SUM(AK198:AM198))","v":0},null,null,null,{"$f":"IF(AO198<Instructions!D225,AO198,SUM(AO198:AQ198))","v":0},"--",0,{"$f":"SUM(Table_2[[#This Row],[Column20]],Table_2[[#This Row],[Column19]],Table_2[[#This Row],[Column18]])","v":0},"HEALTH & PHY. EDU.",{"$f":"(M198/Instructions!$C$23)*100","v":0},{"$f":"(P198/Instructions!$C$24)*100","v":0},{"$f":"(S198/Instructions!$C$25)*100","v":0},{"$f":"(V198/Instructions!$C$26)*100","v":0},{"$f":"(Y198/Instructions!$C$27)*100","v":0},{"$f":"(AB198/Instructions!$C$28)*100","v":0},{"$f":"(AF198/Instructions!$C$29)*100","v":0},{"$f":"(AJ198/Instructions!$C$30)*100","v":0},{"$f":"(AN198/Instructions!$C$31)*100","v":0},0,{"$f":"(AS198/Instructions!$C$33)*100","v":{"$error":"#VALUE!"}},"----","E","E","E","E","E","E","E","E","E","E","--","E",null,null,null,null,{"$f":"Table_2[[#This Row],[Column51]]&Table_2[[#This Row],[Column52]]&BU200","v":""}]
[197,null,null,null,null,null,null,null,null,null,null,null,0,null,null,0,null,null,0,null,null,0,null,null,0,null,null,0,null,null,null,0,null,null,null,{"$f":"IF(AG199<Instructions!D228,AG199,SUM(AG199:AI199))","v":0},null,null,null,{"$f":"IF(AK199<Instructions!D227,AK199,SUM(AK199:AM199))","v":0},null,null,null,{"$f":"IF(AO199<Instructions!D226,AO199,SUM(AO199:AQ199))","v":0},"--",0,{"$f":"SUM(Table_2[[#This Row],[Column20]],Table_2[[#This Row],[Column19]],Table_2[[#This Row],[Column18]])","v":0},"HEALTH & PHY. EDU.",{"$f":"(M199/Instructions!$C$23)*100","v":0},{"$f":"(P199/Instructions!$C$24)*100","v":0},{"$f":"(S199/Instructions!$C$25)*100","v":0},{"$f":"(V199/Instructions!$C$26)*100","v":0},{"$f":"(Y199/Instructions!$C$27)*100","v":0},{"$f":"(AB199/Instructions!$C$28)*100","v":0},{"$f":"(AF199/Instructions!$C$29)*100","v":0},{"$f":"(AJ199/Instructions!$C$30)*100","v":0},{"$f":"(AN199/Instructions!$C$31)*100","v":0},0,{"$f":"(AS199/Instructions!$C$33)*100","v":{"$error":"#VALUE!"}},"----","E","E","E","E","E","E","E","E","E","E","--","E",null,null,null,null,{"$f":"Table_2[[#This Row],[Column51]]&Table_2[[#This Row],[Column52]]&BU201","v":""}]
[198,null,null,null,null,null,null,null,null,null,null,null,0,null,null,0,null,null,0,null,null,0,null,null,0,null,null,0,null,null,null,0,null,null,null,{"$f":"IF(AG200<Instructions!D229,AG200,SUM(AG200:AI200))","v":0},null,null,null,{"$f":"IF(AK200<Instructions!D228,AK200,SUM(AK200:AM200))","v":0},null,null,null,{"$f":"IF(AO200<Instructions!D227,AO200,SUM(AO200:AQ200))","v":0},"--",0,{"$f":"SUM(Table_2[[#This Row],[Column20]],Table_2[[#This Row],[Column19]],Table_2[[#This Row],[Column18]])","v":0},"HEALTH & PHY. EDU.",{"$f":"(M200/Instructions!$C$23)*100","v":0},{"$f":"(P200/Instructions!$C$24)*100","v":0},{"$f":"(S200/Instructions!$C$25)*100","v":0},{"$f":"(V200/Instructions!$C$26)*100","v":0},{"$f":"(Y200/Instructions!$C$27)*100","v":0},{"$f":"(AB200/Instructions!$C$28)*100","v":0},{"$f":"(AF200/Instructions!$C$29)*100","v":0},{"$f":"(AJ200/Instructions!$C$30)*100","v":0},{"$f":"(AN200/Instructions!$C$31)*100","v":0},0,{"$f":"(AS200/Instructions!$C$33)*100","v":{"$error":"#VALUE!"}},"----","E","E","E","E","E","E","E","E","E","E","--","E",null,null,null,null,{"$f":"Table_2[[#This Row],[Column51]]&Table_2[[#This Row],[Column52]]&BU202","v":""}]
[199,null,null,null,null,null,null,null,null,null,null,null,0,null,null,0,null,null,0,null,null,0,null,null,0,null,null,0,null,null,null,0,null,null,null,{"$f":"IF(AG201<Instructions!D230,AG201,SUM(AG201:AI201))","v":0},null,null,null,{"$f":"IF(AK201<Instructions!D229,AK201,SUM(AK201:AM201))","v":0},null,null,null,{"$f":"IF(AO201<Instructions!D228,AO201,SUM(AO201:AQ201))","v":0},"--",0,{"$f":"SUM(Table_2[[#This Row],[Column20]],Table_2[[#This Row],[Column19]],Table_2[[#This Row],[Column18]])","v":0},"HEALTH & PHY. EDU.",{"$f":"(M201/Instructions!$C$23)*100","v":0},{"$f":"(P201/Instructions!$C$24)*100","v":0},{"$f":"(S201/Instructions!$C$25)*100","v":0},{"$f":"(V201/Instructions!$C$26)*100","v":0},{"$f":"(Y201/Instructions!$C$27)*100","v":0},{"$f":"(AB201/Instructions!$C$28)*100","v":0},{"$f":"(AF201/Instructions!$C$29)*100","v":0},{"$f":"(AJ201/Instructions!$C$30)*100","v":0},{"$f":"(AN201/Instructions!$C$31)*100","v":0},0,{"$f":"(AS201/Instructions!$C$33)*100","v":{"$error":"#VALUE!"}},"----","E","E","E","E","E","E","E","E","E","E","--","E",null,null,null,null,{"$f":"Table_2[[#This Row],[Column51]]&Table_2[[#This Row],[Column52]]&BU203","v":""}]
[200,null,null,null,null,null,null,null,null,null,null,null,0,null,null,0,null,null,0,null,null,0,null,null,0,null,null,0,null,null,null,0,null,null,null,{"$f":"IF(AG202<Instructions!D231,AG202,SUM(AG202:AI202))","v":0},null,null,null,{"$f":"IF(AK202<Instructions!D230,AK202,SUM(AK202:AM202))","v":0},null,null,null,{"$f":"IF(AO202<Instructions!D229,AO202,SUM(AO202:AQ202))","v":0},"--",0,{"$f":"SUM(Table_2[[#This Row],[Column20]],Table_2[[#This Row],[Column19]],Table_2[[#This Row],[Column18]])","v":0},"HEALTH & PHY. EDU.",{"$f":"(M202/Instructions!$C$23)*100","v":0},{"$f":"(P202/Instructions!$C$24)*100","v":0},{"$f":"(S202/Instructions!$C$25)*100","v":0},{"$f":"(V202/Instructions!$C$26)*100","v":0},{"$f":"(Y202/Instructions!$C$27)*100","v":0},{"$f":"(AB202/Instructions!$C$28)*100","v":0},{"$f":"(AF202/Instructions!$C$29)*100","v":0},{"$f":"(AJ202/Instructions!$C$30)*100","v":0},{"$f":"(AN202/Instructions!$C$31)*100","v":0},0,{"$f":"(AS202/Instructions!$C$33)*100","v":{"$error":"#VALUE!"}},"----","E","E","E","E","E","E","E","E","E","E","--","E",null,null,null,null,{"$f":"Table_2[[#This Row],[Column51]]&Table_2[[#This Row],[Column52]]&BU204","v":""}]
[201,null,null,null,null,null,null,null,null,null,null,null,0,null,null,0,null,null,0,null,null,0,null,null,0,null,null,0,null,null,null,0,null,null,null,{"$f":"IF(AG203<Instructions!D232,AG203,SUM(AG203:AI203))","v":0},null,null,null,{"$f":"IF(AK203<Instructions!D231,AK203,SUM(AK203:AM203))","v":0},null,null,null,{"$f":"IF(AO203<Instructions!D230,AO203,SUM(AO203:AQ203))","v":0},"--",0,{"$f":"SUM(Table_2[[#This Row],[Column20]],Table_2[[#This Row],[Column19]],Table_2[[#This Row],[Column18]])","v":0},"HEALTH & PHY. EDU.",{"$f":"(M203/Instructions!$C$23)*100","v":0},{"$f":"(P203/Instructions!$C$24)*100","v":0},{"$f":"(S203/Instructions!$C$25)*100","v":0},{"$f":"(V203/Instructions!$C$26)*100","v":0},{"$f":"(Y203/Instructions!$C$27)*100","v":0},{"$f":"(AB203/Instructions!$C$28)*100","v":0},{"$f":"(AF203/Instructions!$C$29)*100","v":0},{"$f":"(AJ203/Instructions!$C$30)*100","v":0},{"$f":"(AN203/Instructions!$C$31)*100","v":0},0,{"$f":"(AS203/Instructions!$C$33)*100","v":{"$error":"#VALUE!"}},"----","E","E","E","E","E","E","E","E","E","E","--","E",null,null,null,null,{"$f":"Table_2[[#This Row],[Column51]]&Table_2[[#This Row],[Column52]]&BU205","v":""}]
[202,null,null,null,null,null,null,null,null,null,null,null,0,null,null,0,null,null,0,null,null,0,null,null,0,null,null,0,null,null,null,0,null,null,null,{"$f":"IF(AG204<Instructions!D233,AG204,SUM(AG204:AI204))","v":0},null,null,null,{"$f":"IF(AK204<Instructions!D232,AK204,SUM(AK204:AM204))","v":0},null,null,null,{"$f":"IF(AO204<Instructions!D231,AO204,SUM(AO204:AQ204))","v":0},"--",0,{"$f":"SUM(Table_2[[#This Row],[Column20]],Table_2[[#This Row],[Column19]],Table_2[[#This Row],[Column18]])","v":0},"HEALTH & PHY. EDU.",{"$f":"(M204/Instructions!$C$23)*100","v":0},{"$f":"(P204/Instructions!$C$24)*100","v":0},{"$f":"(S204/Instructions!$C$25)*100","v":0},{"$f":"(V204/Instructions!$C$26)*100","v":0},{"$f":"(Y204/Instructions!$C$27)*100","v":0},{"$f":"(AB204/Instructions!$C$28)*100","v":0},{"$f":"(AF204/Instructions!$C$29)*100","v":0},{"$f":"(AJ204/Instructions!$C$30)*100","v":0},{"$f":"(AN204/Instructions!$C$31)*100","v":0},0,{"$f":"(AS204/Instructions!$C$33)*100","v":{"$error":"#VALUE!"}},"----","E","E","E","E","E","E","E","E","E","E","--","E",null,null,null,null,{"$f":"Table_2[[#This Row],[Column51]]&Table_2[[#This Row],[Column52]]&BU206","v":""}]
[203,null,null,null,null,null,null,null,null,null,null,null,0,null,null,0,null,null,0,null,null,0,null,null,0,null,null,0,null,null,null,0,null,null,null,{"$f":"IF(AG205<Instructions!D234,AG205,SUM(AG205:AI205))","v":0},null,null,null,{"$f":"IF(AK205<Instructions!D233,AK205,SUM(AK205:AM205))","v":0},null,null,null,{"$f":"IF(AO205<Instructions!D232,AO205,SUM(AO205:AQ205))","v":0},"--",0,{"$f":"SUM(Table_2[[#This Row],[Column20]],Table_2[[#This Row],[Column19]],Table_2[[#This Row],[Column18]])","v":0},"HEALTH & PHY. EDU.",{"$f":"(M205/Instructions!$C$23)*100","v":0},{"$f":"(P205/Instructions!$C$24)*100","v":0},{"$f":"(S205/Instructions!$C$25)*100","v":0},{"$f":"(V205/Instructions!$C$26)*100","v":0},{"$f":"(Y205/Instructions!$C$27)*100","v":0},{"$f":"(AB205/Instructions!$C$28)*100","v":0},{"$f":"(AF205/Instructions!$C$29)*100","v":0},{"$f":"(AJ205/Instructions!$C$30)*100","v":0},{"$f":"(AN205/Instructions!$C$31)*100","v":0},0,{"$f":"(AS205/Instructions!$C$33)*100","v":{"$error":"#VALUE!"}},"----","E","E","E","E","E","E","E","E","E","E","--","E",null,null,null,null,{"$f":"Table_2[[#This Row],[Column51]]&Table_2[[#This Row],[Column52]]&BU207","v":""}]
[204,null,null,null,null,null,null,null,null,null,null,null,0,null,null,0,null,null,0,null,null,0,null,null,0,null,null,0,null,null,null,0,null,null,null,{"$f":"IF(AG206<Instructions!D235,AG206,SUM(AG206:AI206))","v":0},null,null,null,{"$f":"IF(AK206<Instructions!D234,AK206,SUM(AK206:AM206))","v":0},null,null,null,{"$f":"IF(AO206<Instructions!D233,AO206,SUM(AO206:AQ206))","v":0},"--",0,{"$f":"SUM(Table_2[[#This Row],[Column20]],Table_2[[#This Row],[Column19]],Table_2[[#This Row],[Column18]])","v":0},"HEALTH & PHY. EDU.",{"$f":"(M206/Instructions!$C$23)*100","v":0},{"$f":"(P206/Instructions!$C$24)*100","v":0},{"$f":"(S206/Instructions!$C$25)*100","v":0},{"$f":"(V206/Instructions!$C$26)*100","v":0},{"$f":"(Y206/Instructions!$C$27)*100","v":0},{"$f":"(AB206/Instructions!$C$28)*100","v":0},{"$f":"(AF206/Instructions!$C$29)*100","v":0},{"$f":"(AJ206/Instructions!$C$30)*100","v":0},{"$f":"(AN206/Instructions!$C$31)*100","v":0},0,{"$f":"(AS206/Instructions!$C$33)*100","v":{"$error":"#VALUE!"}},"----","E","E","E","E","E","E","E","E","E","E","--","E",null,null,null,null,{"$f":"Table_2[[#This Row],[Column51]]&Table_2[[#This Row],[Column52]]&BU208","v":""}]
[205,null,null,null,null,null,null,null,null,null,null,null,0,null,null,0,null,null,0,null,null,0,null,null,0,null,null,0,null,null,null,0,null,null,null,{"$f":"IF(AG207<Instructions!D236,AG207,SUM(AG207:AI207))","v":0},null,null,null,{"$f":"IF(AK207<Instructions!D235,AK207,SUM(AK207:AM207))","v":0},null,null,null,{"$f":"IF(AO207<Instructions!D234,AO207,SUM(AO207:AQ207))","v":0},"--",0,{"$f":"SUM(Table_2[[#This Row],[Column20]],Table_2[[#This Row],[Column19]],Table_2[[#This Row],[Column18]])","v":0},"HEALTH & PHY. EDU.",{"$f":"(M207/Instructions!$C$23)*100","v":0},{"$f":"(P207/Instructions!$C$24)*100","v":0},{"$f":"(S207/Instructions!$C$25)*100","v":0},{"$f":"(V207/Instructions!$C$26)*100","v":0},{"$f":"(Y207/Instructions!$C$27)*100","v":0},{"$f":"(AB207/Instructions!$C$28)*100","v":0},{"$f":"(AF207/Instructions!$C$29)*100","v":0},{"$f":"(AJ207/Instructions!$C$30)*100","v":0},{"$f":"(AN207/Instructions!$C$31)*100","v":0},0,{"$f":"(AS207/Instructions!$C$33)*100","v":{"$error":"#VALUE!"}},"----","E","E","E","E","E","E","E","E","E","E","--","E",null,null,null,null,{"$f":"Table_2[[#This Row],[Column51]]&Table_2[[#This Row],[Column52]]&BU209","v":""}]
[206,null,null,null,null,null,null,null,null,null,null,null,0,null,null,0,null,null,0,null,null,0,null,null,0,null,null,0,null,null,null,0,null,null,null,{"$f":"IF(AG208<Instructions!D237,AG208,SUM(AG208:AI208))","v":0},null,null,null,{"$f":"IF(AK208<Instructions!D236,AK208,SUM(AK208:AM208))","v":0},null,null,null,{"$f":"IF(AO208<Instructions!D235,AO208,SUM(AO208:AQ208))","v":0},"--",0,{"$f":"SUM(Table_2[[#This Row],[Column20]],Table_2[[#This Row],[Column19]],Table_2[[#This Row],[Column18]])","v":0},"HEALTH & PHY. EDU.",{"$f":"(M208/Instructions!$C$23)*100","v":0},{"$f":"(P208/Instructions!$C$24)*100","v":0},{"$f":"(S208/Instructions!$C$25)*100","v":0},{"$f":"(V208/Instructions!$C$26)*100","v":0},{"$f":"(Y208/Instructions!$C$27)*100","v":0},{"$f":"(AB208/Instructions!$C$28)*100","v":0},{"$f":"(AF208/Instructions!$C$29)*100","v":0},{"$f":"(AJ208/Instructions!$C$30)*100","v":0},{"$f":"(AN208/Instructions!$C$31)*100","v":0},0,{"$f":"(AS208/Instructions!$C$33)*100","v":{"$error":"#VALUE!"}},"----","E","E","E","E","E","E","E","E","E","E","--","E",null,null,null,null,{"$f":"Table_2[[#This Row],[Column51]]&Table_2[[#This Row],[Column52]]&BU210","v":""}]
[207,null,null,null,null,null,null,null,null,null,null,null,0,null,null,0,null,null,0,null,null,0,null,null,0,null,null,0,null,null,null,0,null,null,null,{"$f":"IF(AG209<Instructions!D238,AG209,SUM(AG209:AI209))","v":0},null,null,null,{"$f":"IF(AK209<Instructions!D237,AK209,SUM(AK209:AM209))","v":0},null,null,null,{"$f":"IF(AO209<Instructions!D236,AO209,SUM(AO209:AQ209))","v":0},"--",0,{"$f":"SUM(Table_2[[#This Row],[Column20]],Table_2[[#This Row],[Column19]],Table_2[[#This Row],[Column18]])","v":0},"HEALTH & PHY. EDU.",{"$f":"(M209/Instructions!$C$23)*100","v":0},{"$f":"(P209/Instructions!$C$24)*100","v":0},{"$f":"(S209/Instructions!$C$25)*100","v":0},{"$f":"(V209/Instructions!$C$26)*100","v":0},{"$f":"(Y209/Instructions!$C$27)*100","v":0},{"$f":"(AB209/Instructions!$C$28)*100","v":0},{"$f":"(AF209/Instructions!$C$29)*100","v":0},{"$f":"(AJ209/Instructions!$C$30)*100","v":0},{"$f":"(AN209/Instructions!$C$31)*100","v":0},0,{"$f":"(AS209/Instructions!$C$33)*100","v":{"$error":"#VALUE!"}},"----","E","E","E","E","E","E","E","E","E","E","--","E",null,null,null,null,{"$f":"Table_2[[#This Row],[Column51]]&Table_2[[#This Row],[Column52]]&BU211","v":""}]
[208,null,null,null,null,null,null,null,null,null,null,null,0,null,null,0,null,null,0,null,null,0,null,null,0,null,null,0,null,null,null,0,null,null,null,{"$f":"IF(AG210<Instructions!D239,AG210,SUM(AG210:AI210))","v":0},null,null,null,{"$f":"IF(AK210<Instructions!D238,AK210,SUM(AK210:AM210))","v":0},null,null,null,{"$f":"IF(AO210<Instructions!D237,AO210,SUM(AO210:AQ210))","v":0},"--",0,{"$f":"SUM(Table_2[[#This Row],[Column20]],Table_2[[#This Row],[Column19]],Table_2[[#This Row],[Column18]])","v":0},"HEALTH & PHY. EDU.",{"$f":"(M210/Instructions!$C$23)*100","v":0},{"$f":"(P210/Instructions!$C$24)*100","v":0},{"$f":"(S210/Instructions!$C$25)*100","v":0},{"$f":"(V210/Instructions!$C$26)*100","v":0},{"$f":"(Y210/Instructions!$C$27)*100","v":0},{"$f":"(AB210/Instructions!$C$28)*100","v":0},{"$f":"(AF210/Instructions!$C$29)*100","v":0},{"$f":"(AJ210/Instructions!$C$30)*100","v":0},{"$f":"(AN210/Instructions!$C$31)*100","v":0},0,{"$f":"(AS210/Instructions!$C$33)*100","v":{"$error":"#VALUE!"}},"----","E","E","E","E","E","E","E","E","E","E","--","E",null,null,null,null,{"$f":"Table_2[[#This Row],[Column51]]&Table_2[[#This Row],[Column52]]&BU212","v":""}]
[209,null,null,null,null,null,null,null,null,null,null,null,0,null,null,0,null,null,0,null,null,0,null,null,0,null,null,0,null,null,null,0,null,null,null,{"$f":"IF(AG211<Instructions!D240,AG211,SUM(AG211:AI211))","v":0},null,null,null,{"$f":"IF(AK211<Instructions!D239,AK211,SUM(AK211:AM211))","v":0},null,null,null,{"$f":"IF(AO211<Instructions!D238,AO211,SUM(AO211:AQ211))","v":0},"--",0,{"$f":"SUM(Table_2[[#This Row],[Column20]],Table_2[[#This Row],[Column19]],Table_2[[#This Row],[Column18]])","v":0},"HEALTH & PHY. EDU.",{"$f":"(M211/Instructions!$C$23)*100","v":0},{"$f":"(P211/Instructions!$C$24)*100","v":0},{"$f":"(S211/Instructions!$C$25)*100","v":0},{"$f":"(V211/Instructions!$C$26)*100","v":0},{"$f":"(Y211/Instructions!$C$27)*100","v":0},{"$f":"(AB211/Instructions!$C$28)*100","v":0},{"$f":"(AF211/Instructions!$C$29)*100","v":0},{"$f":"(AJ211/Instructions!$C$30)*100","v":0},{"$f":"(AN211/Instructions!$C$31)*100","v":0},0,{"$f":"(AS211/Instructions!$C$33)*100","v":{"$error":"#VALUE!"}},"----",{"$f":"IFERROR(IF(AW211>90,\"A+\",IF(AW211>80,\"A\",IF(AW211>70,\"B+\",IF(AW211>60,\"B\",IF(AW211>50,\"C+\",IF(AW211>40,\"C\",IF(AW211>=33,\"D\",\"E\"))))))),\"Abs\")","v":"E"},"E","E","E","E","E","E","E","E","E","--","E",null,null,null,null,{"$f":"Table_2[[#This Row],[Column51]]&Table_2[[#This Row],[Column52]]&BU213","v":""}]
[210,null,null,null,null,null,null,null,null,null,null,null,0,null,null,0,null,null,0,null,null,0,null,null,0,null,null,0,null,null,null,0,null,null,null,{"$f":"IF(AG212<Instructions!D241,AG212,SUM(AG212:AI212))","v":0},null,null,null,{"$f":"IF(AK212<Instructions!D240,AK212,SUM(AK212:AM212))","v":0},null,null,null,{"$f":"IF(AO212<Instructions!D239,AO212,SUM(AO212:AQ212))","v":0},"--",0,{"$f":"SUM(Table_2[[#This Row],[Column20]],Table_2[[#This Row],[Column19]],Table_2[[#This Row],[Column18]])","v":0},"HEALTH & PHY. EDU.",{"$f":"(M212/Instructions!$C$23)*100","v":0},{"$f":"(P212/Instructions!$C$24)*100","v":0},{"$f":"(S212/Instructions!$C$25)*100","v":0},{"$f":"(V212/Instructions!$C$26)*100","v":0},{"$f":"(Y212/Instructions!$C$27)*100","v":0},{"$f":"(AB212/Instructions!$C$28)*100","v":0},{"$f":"(AF212/Instructions!$C$29)*100","v":0},{"$f":"(AJ212/Instructions!$C$30)*100","v":0},{"$f":"(AN212/Instructions!$C$31)*100","v":0},0,{"$f":"(AS212/Instructions!$C$33)*100","v":{"$error":"#VALUE!"}},"----","E","E","E","E","E","E","E","E","E","E","--","E",null,null,null,null,{"$f":"Table_2[[#This Row],[Column51]]&Table_2[[#This Row],[Column52]]&BU214","v":""}]
[211,null,null,null,null,null,null,null,null,null,null,null,0,null,null,0,null,null,0,null,null,0,null,null,0,null,null,0,null,null,null,0,null,null,null,{"$f":"IF(AG213<Instructions!D242,AG213,SUM(AG213:AI213))","v":0},null,null,null,{"$f":"IF(AK213<Instructions!D241,AK213,SUM(AK213:AM213))","v":0},null,null,null,{"$f":"IF(AO213<Instructions!D240,AO213,SUM(AO213:AQ213))","v":0},"--",0,{"$f":"SUM(Table_2[[#This Row],[Column20]],Table_2[[#This Row],[Column19]],Table_2[[#This Row],[Column18]])","v":0},"HEALTH & PHY. EDU.",{"$f":"(M213/Instructions!$C$23)*100","v":0},{"$f":"(P213/Instructions!$C$24)*100","v":0},{"$f":"(S213/Instructions!$C$25)*100","v":0},{"$f":"(V213/Instructions!$C$26)*100","v":0},{"$f":"(Y213/Instructions!$C$27)*100","v":0},{"$f":"(AB213/Instructions!$C$28)*100","v":0},{"$f":"(AF213/Instructions!$C$29)*100","v":0},{"$f":"(AJ213/Instructions!$C$30)*100","v":0},{"$f":"(AN213/Instructions!$C$31)*100","v":0},0,{"$f":"(AS213/Instructions!$C$33)*100","v":{"$error":"#VALUE!"}},"----","E","E","E","E","E","E","E","E","E","E","--","E",null,null,null,null,{"$f":"Table_2[[#This Row],[Column51]]&Table_2[[#This Row],[Column52]]&BU215","v":""}]
[212,null,null,null,null,null,null,null,null,null,null,null,0,null,null,0,null,null,0,null,null,0,null,null,0,null,null,0,null,null,null,0,null,null,null,{"$f":"IF(AG214<Instructions!D243,AG214,SUM(AG214:AI214))","v":0},null,null,null,{"$f":"IF(AK214<Instructions!D242,AK214,SUM(AK214:AM214))","v":0},null,null,null,{"$f":"IF(AO214<Instructions!D241,AO214,SUM(AO214:AQ214))","v":0},"--",0,{"$f":"SUM(Table_2[[#This Row],[Column20]],Table_2[[#This Row],[Column19]],Table_2[[#This Row],[Column18]])","v":0},"HEALTH & PHY. EDU.",{"$f":"(M214/Instructions!$C$23)*100","v":0},{"$f":"(P214/Instructions!$C$24)*100","v":0},{"$f":"(S214/Instructions!$C$25)*100","v":0},{"$f":"(V214/Instructions!$C$26)*100","v":0},{"$f":"(Y214/Instructions!$C$27)*100","v":0},{"$f":"(AB214/Instructions!$C$28)*100","v":0},{"$f":"(AF214/Instructions!$C$29)*100","v":0},{"$f":"(AJ214/Instructions!$C$30)*100","v":0},{"$f":"(AN214/Instructions!$C$31)*100","v":0},0,{"$f":"(AS214/Instructions!$C$33)*100","v":{"$error":"#VALUE!"}},"----","E","E","E","E","E","E","E","E","E","E","--","E",null,null,null,null,{"$f":"Table_2[[#This Row],[Column51]]&Table_2[[#This Row],[Column52]]&BU216","v":""}]
[213,null,null,null,null,null,null,null,null,null,null,null,0,null,null,0,null,null,0,null,null,0,null,null,0,null,null,0,null,null,null,0,null,null,null,{"$f":"IF(AG215<Instructions!D244,AG215,SUM(AG215:AI215))","v":0},null,null,null,{"$f":"IF(AK215<Instructions!D243,AK215,SUM(AK215:AM215))","v":0},null,null,null,{"$f":"IF(AO215<Instructions!D242,AO215,SUM(AO215:AQ215))","v":0},"--",0,{"$f":"SUM(Table_2[[#This Row],[Column20]],Table_2[[#This Row],[Column19]],Table_2[[#This Row],[Column18]])","v":0},"HEALTH & PHY. EDU.",{"$f":"(M215/Instructions!$C$23)*100","v":0},{"$f":"(P215/Instructions!$C$24)*100","v":0},{"$f":"(S215/Instructions!$C$25)*100","v":0},{"$f":"(V215/Instructions!$C$26)*100","v":0},{"$f":"(Y215/Instructions!$C$27)*100","v":0},{"$f":"(AB215/Instructions!$C$28)*100","v":0},{"$f":"(AF215/Instructions!$C$29)*100","v":0},{"$f":"(AJ215/Instructions!$C$30)*100","v":0},{"$f":"(AN215/Instructions!$C$31)*100","v":0},0,{"$f":"(AS215/Instructions!$C$33)*100","v":{"$error":"#VALUE!"}},"----","E","E","E","E","E","E","E","E","E","E","--","E",null,null,null,null,{"$f":"Table_2[[#This Row],[Column51]]&Table_2[[#This Row],[Column52]]&BU217","v":""}]
[214,null,null,null,null,null,null,null,null,null,null,null,0,null,null,0,null,null,0,null,null,0,null,null,0,null,null,0,null,null,null,0,null,null,null,{"$f":"IF(AG216<Instructions!D245,AG216,SUM(AG216:AI216))","v":0},null,null,null,{"$f":"IF(AK216<Instructions!D244,AK216,SUM(AK216:AM216))","v":0},null,null,null,{"$f":"IF(AO216<Instructions!D243,AO216,SUM(AO216:AQ216))","v":0},"--",0,{"$f":"SUM(Table_2[[#This Row],[Column20]],Table_2[[#This Row],[Column19]],Table_2[[#This Row],[Column18]])","v":0},"HEALTH & PHY. EDU.",{"$f":"(M216/Instructions!$C$23)*100","v":0},{"$f":"(P216/Instructions!$C$24)*100","v":0},{"$f":"(S216/Instructions!$C$25)*100","v":0},{"$f":"(V216/Instructions!$C$26)*100","v":0},{"$f":"(Y216/Instructions!$C$27)*100","v":0},{"$f":"(AB216/Instructions!$C$28)*100","v":0},{"$f":"(AF216/Instructions!$C$29)*100","v":0},{"$f":"(AJ216/Instructions!$C$30)*100","v":0},{"$f":"(AN216/Instructions!$C$31)*100","v":0},0,{"$f":"(AS216/Instructions!$C$33)*100","v":{"$error":"#VALUE!"}},"----","E","E","E","E","E","E","E","E","E","E","--","E",null,null,null,null,{"$f":"Table_2[[#This Row],[Column51]]&Table_2[[#This Row],[Column52]]&BU218","v":""}]
[215,null,null,null,null,null,null,null,null,null,null,null,0,null,null,0,null,null,0,null,null,0,null,null,0,null,null,0,null,null,null,0,null,null,null,{"$f":"IF(AG217<Instructions!D246,AG217,SUM(AG217:AI217))","v":0},null,null,null,{"$f":"IF(AK217<Instructions!D245,AK217,SUM(AK217:AM217))","v":0},null,null,null,{"$f":"IF(AO217<Instructions!D244,AO217,SUM(AO217:AQ217))","v":0},"--",0,{"$f":"SUM(Table_2[[#This Row],[Column20]],Table_2[[#This Row],[Column19]],Table_2[[#This Row],[Column18]])","v":0},"HEALTH & PHY. EDU.",{"$f":"(M217/Instructions!$C$23)*100","v":0},{"$f":"(P217/Instructions!$C$24)*100","v":0},{"$f":"(S217/Instructions!$C$25)*100","v":0},{"$f":"(V217/Instructions!$C$26)*100","v":0},{"$f":"(Y217/Instructions!$C$27)*100","v":0},{"$f":"(AB217/Instructions!$C$28)*100","v":0},{"$f":"(AF217/Instructions!$C$29)*100","v":0},{"$f":"(AJ217/Instructions!$C$30)*100","v":0},{"$f":"(AN217/Instructions!$C$31)*100","v":0},0,{"$f":"(AS217/Instructions!$C$33)*100","v":{"$error":"#VALUE!"}},"----","E","E","E","E","E","E","E","E","E","E","--","E",null,null,null,null,{"$f":"Table_2[[#This Row],[Column51]]&Table_2[[#This Row],[Column52]]&BU219","v":""}]
[216,null,null,null,null,null,null,null,null,null,null,null,0,null,null,0,null,null,0,null,null,0,null,null,0,null,null,0,null,null,null,0,null,null,null,{"$f":"IF(AG218<Instructions!D247,AG218,SUM(AG218:AI218))","v":0},null,null,null,{"$f":"IF(AK218<Instructions!D246,AK218,SUM(AK218:AM218))","v":0},null,null,null,{"$f":"IF(AO218<Instructions!D245,AO218,SUM(AO218:AQ218))","v":0},"--",0,{"$f":"SUM(Table_2[[#This Row],[Column20]],Table_2[[#This Row],[Column19]],Table_2[[#This Row],[Column18]])","v":0},"HEALTH & PHY. EDU.",{"$f":"(M218/Instructions!$C$23)*100","v":0},{"$f":"(P218/Instructions!$C$24)*100","v":0},{"$f":"(S218/Instructions!$C$25)*100","v":0},{"$f":"(V218/Instructions!$C$26)*100","v":0},{"$f":"(Y218/Instructions!$C$27)*100","v":0},{"$f":"(AB218/Instructions!$C$28)*100","v":0},{"$f":"(AF218/Instructions!$C$29)*100","v":0},{"$f":"(AJ218/Instructions!$C$30)*100","v":0},{"$f":"(AN218/Instructions!$C$31)*100","v":0},0,{"$f":"(AS218/Instructions!$C$33)*100","v":{"$error":"#VALUE!"}},"----","E","E","E","E","E","E","E","E","E","E","--","E",null,null,null,null,{"$f":"Table_2[[#This Row],[Column51]]&Table_2[[#This Row],[Column52]]&BU220","v":""}]
[217,null,null,null,null,null,null,null,null,null,null,null,0,null,null,0,null,null,0,null,null,0,null,null,0,null,null,0,null,null,null,0,null,null,null,{"$f":"IF(AG219<Instructions!D248,AG219,SUM(AG219:AI219))","v":0},null,null,null,{"$f":"IF(AK219<Instructions!D247,AK219,SUM(AK219:AM219))","v":0},null,null,null,{"$f":"IF(AO219<Instructions!D246,AO219,SUM(AO219:AQ219))","v":0},"--",0,{"$f":"SUM(Table_2[[#This Row],[Column20]],Table_2[[#This Row],[Column19]],Table_2[[#This Row],[Column18]])","v":0},"HEALTH & PHY. EDU.",{"$f":"(M219/Instructions!$C$23)*100","v":0},{"$f":"(P219/Instructions!$C$24)*100","v":0},{"$f":"(S219/Instructions!$C$25)*100","v":0},{"$f":"(V219/Instructions!$C$26)*100","v":0},{"$f":"(Y219/Instructions!$C$27)*100","v":0},{"$f":"(AB219/Instructions!$C$28)*100","v":0},{"$f":"(AF219/Instructions!$C$29)*100","v":0},{"$f":"(AJ219/Instructions!$C$30)*100","v":0},{"$f":"(AN219/Instructions!$C$31)*100","v":0},0,{"$f":"(AS219/Instructions!$C$33)*100","v":{"$error":"#VALUE!"}},"----","E","E","E","E","E","E","E","E","E","E","--","E",null,null,null,null,{"$f":"Table_2[[#This Row],[Column51]]&Table_2[[#This Row],[Column52]]&BU221","v":""}]
[218,null,null,null,null,null,null,null,null,null,null,null,0,null,null,0,null,null,0,null,null,0,null,null,0,null,null,0,null,null,null,0,null,null,null,{"$f":"IF(AG220<Instructions!D249,AG220,SUM(AG220:AI220))","v":0},null,null,null,{"$f":"IF(AK220<Instructions!D248,AK220,SUM(AK220:AM220))","v":0},null,null,null,{"$f":"IF(AO220<Instructions!D247,AO220,SUM(AO220:AQ220))","v":0},"--",0,{"$f":"SUM(Table_2[[#This Row],[Column20]],Table_2[[#This Row],[Column19]],Table_2[[#This Row],[Column18]])","v":0},"HEALTH & PHY. EDU.",{"$f":"(M220/Instructions!$C$23)*100","v":0},{"$f":"(P220/Instructions!$C$24)*100","v":0},{"$f":"(S220/Instructions!$C$25)*100","v":0},{"$f":"(V220/Instructions!$C$26)*100","v":0},{"$f":"(Y220/Instructions!$C$27)*100","v":0},{"$f":"(AB220/Instructions!$C$28)*100","v":0},{"$f":"(AF220/Instructions!$C$29)*100","v":0},{"$f":"(AJ220/Instructions!$C$30)*100","v":0},{"$f":"(AN220/Instructions!$C$31)*100","v":0},0,{"$f":"(AS220/Instructions!$C$33)*100","v":{"$error":"#VALUE!"}},"----","E","E","E","E","E","E","E","E","E","E","--","E",null,null,null,null,{"$f":"Table_2[[#This Row],[Column51]]&Table_2[[#This Row],[Column52]]&BU222","v":""}]
[219,null,null,null,null,null,null,null,null,null,null,null,0,null,null,0,null,null,0,null,null,0,null,null,0,null,null,0,null,null,null,0,null,null,null,{"$f":"IF(AG221<Instructions!D250,AG221,SUM(AG221:AI221))","v":0},null,null,null,{"$f":"IF(AK221<Instructions!D249,AK221,SUM(AK221:AM221))","v":0},null,null,null,{"$f":"IF(AO221<Instructions!D248,AO221,SUM(AO221:AQ221))","v":0},"--",0,{"$f":"SUM(Table_2[[#This Row],[Column20]],Table_2[[#This Row],[Column19]],Table_2[[#This Row],[Column18]])","v":0},"HEALTH & PHY. EDU.",{"$f":"(M221/Instructions!$C$23)*100","v":0},{"$f":"(P221/Instructions!$C$24)*100","v":0},{"$f":"(S221/Instructions!$C$25)*100","v":0},{"$f":"(V221/Instructions!$C$26)*100","v":0},{"$f":"(Y221/Instructions!$C$27)*100","v":0},{"$f":"(AB221/Instructions!$C$28)*100","v":0},{"$f":"(AF221/Instructions!$C$29)*100","v":0},{"$f":"(AJ221/Instructions!$C$30)*100","v":0},{"$f":"(AN221/Instructions!$C$31)*100","v":0},0,{"$f":"(AS221/Instructions!$C$33)*100","v":{"$error":"#VALUE!"}},"----","E","E","E","E","E","E","E","E","E","E","--","E",null,null,null,null,{"$f":"Table_2[[#This Row],[Column51]]&Table_2[[#This Row],[Column52]]&BU223","v":""}]
[220,null,null,null,null,null,null,null,null,null,null,null,0,null,null,0,null,null,0,null,null,0,null,null,0,null,null,0,null,null,null,0,null,null,null,{"$f":"IF(AG222<Instructions!D251,AG222,SUM(AG222:AI222))","v":0},null,null,null,{"$f":"IF(AK222<Instructions!D250,AK222,SUM(AK222:AM222))","v":0},null,null,null,{"$f":"IF(AO222<Instructions!D249,AO222,SUM(AO222:AQ222))","v":0},"--",0,{"$f":"SUM(Table_2[[#This Row],[Column20]],Table_2[[#This Row],[Column19]],Table_2[[#This Row],[Column18]])","v":0},"HEALTH & PHY. EDU.",{"$f":"(M222/Instructions!$C$23)*100","v":0},{"$f":"(P222/Instructions!$C$24)*100","v":0},{"$f":"(S222/Instructions!$C$25)*100","v":0},{"$f":"(V222/Instructions!$C$26)*100","v":0},{"$f":"(Y222/Instructions!$C$27)*100","v":0},{"$f":"(AB222/Instructions!$C$28)*100","v":0},{"$f":"(AF222/Instructions!$C$29)*100","v":0},{"$f":"(AJ222/Instructions!$C$30)*100","v":0},{"$f":"(AN222/Instructions!$C$31)*100","v":0},0,{"$f":"(AS222/Instructions!$C$33)*100","v":{"$error":"#VALUE!"}},"----","E","E","E","E","E","E","E","E","E","E","--","E",null,null,null,null,{"$f":"Table_2[[#This Row],[Column51]]&Table_2[[#This Row],[Column52]]&BU224","v":""}]
[221,null,null,null,null,null,null,null,null,null,null,null,0,null,null,0,null,null,0,null,null,0,null,null,0,null,null,0,null,null,null,0,null,null,null,{"$f":"IF(AG223<Instructions!D252,AG223,SUM(AG223:AI223))","v":0},null,null,null,{"$f":"IF(AK223<Instructions!D251,AK223,SUM(AK223:AM223))","v":0},null,null,null,{"$f":"IF(AO223<Instructions!D250,AO223,SUM(AO223:AQ223))","v":0},"--",0,{"$f":"SUM(Table_2[[#This Row],[Column20]],Table_2[[#This Row],[Column19]],Table_2[[#This Row],[Column18]])","v":0},"HEALTH & PHY. EDU.",{"$f":"(M223/Instructions!$C$23)*100","v":0},{"$f":"(P223/Instructions!$C$24)*100","v":0},{"$f":"(S223/Instructions!$C$25)*100","v":0},{"$f":"(V223/Instructions!$C$26)*100","v":0},{"$f":"(Y223/Instructions!$C$27)*100","v":0},{"$f":"(AB223/Instructions!$C$28)*100","v":0},{"$f":"(AF223/Instructions!$C$29)*100","v":0},{"$f":"(AJ223/Instructions!$C$30)*100","v":0},{"$f":"(AN223/Instructions!$C$31)*100","v":0},0,{"$f":"(AS223/Instructions!$C$33)*100","v":{"$error":"#VALUE!"}},"----","E","E","E","E","E","E","E","E","E","E","--","E",null,null,null,null,{"$f":"Table_2[[#This Row],[Column51]]&Table_2[[#This Row],[Column52]]&BU225","v":""}]
[222,null,null,null,null,null,null,null,null,null,null,null,0,null,null,0,null,null,0,null,null,0,null,null,0,null,null,0,null,null,null,0,null,null,null,{"$f":"IF(AG224<Instructions!D253,AG224,SUM(AG224:AI224))","v":0},null,null,null,{"$f":"IF(AK224<Instructions!D252,AK224,SUM(AK224:AM224))","v":0},null,null,null,{"$f":"IF(AO224<Instructions!D251,AO224,SUM(AO224:AQ224))","v":0},"--",0,{"$f":"SUM(Table_2[[#This Row],[Column20]],Table_2[[#This Row],[Column19]],Table_2[[#This Row],[Column18]])","v":0},"HEALTH & PHY. EDU.",{"$f":"(M224/Instructions!$C$23)*100","v":0},{"$f":"(P224/Instructions!$C$24)*100","v":0},{"$f":"(S224/Instructions!$C$25)*100","v":0},{"$f":"(V224/Instructions!$C$26)*100","v":0},{"$f":"(Y224/Instructions!$C$27)*100","v":0},{"$f":"(AB224/Instructions!$C$28)*100","v":0},{"$f":"(AF224/Instructions!$C$29)*100","v":0},{"$f":"(AJ224/Instructions!$C$30)*100","v":0},{"$f":"(AN224/Instructions!$C$31)*100","v":0},0,{"$f":"(AS224/Instructions!$C$33)*100","v":{"$error":"#VALUE!"}},"----","E","E","E","E","E","E","E","E","E","E","--","E",null,null,null,null,{"$f":"Table_2[[#This Row],[Column51]]&Table_2[[#This Row],[Column52]]&BU226","v":""}]
[223,null,null,null,null,null,null,null,null,null,null,null,0,null,null,0,null,null,0,null,null,0,null,null,0,null,null,0,null,null,null,0,null,null,null,{"$f":"IF(AG225<Instructions!D254,AG225,SUM(AG225:AI225))","v":0},null,null,null,{"$f":"IF(AK225<Instructions!D253,AK225,SUM(AK225:AM225))","v":0},null,null,null,{"$f":"IF(AO225<Instructions!D252,AO225,SUM(AO225:AQ225))","v":0},"--",0,{"$f":"SUM(Table_2[[#This Row],[Column20]],Table_2[[#This Row],[Column19]],Table_2[[#This Row],[Column18]])","v":0},"HEALTH & PHY. EDU.",{"$f":"(M225/Instructions!$C$23)*100","v":0},{"$f":"(P225/Instructions!$C$24)*100","v":0},{"$f":"(S225/Instructions!$C$25)*100","v":0},{"$f":"(V225/Instructions!$C$26)*100","v":0},{"$f":"(Y225/Instructions!$C$27)*100","v":0},{"$f":"(AB225/Instructions!$C$28)*100","v":0},{"$f":"(AF225/Instructions!$C$29)*100","v":0},{"$f":"(AJ225/Instructions!$C$30)*100","v":0},{"$f":"(AN225/Instructions!$C$31)*100","v":0},0,{"$f":"(AS225/Instructions!$C$33)*100","v":{"$error":"#VALUE!"}},"----","E","E","E","E","E","E","E","E","E","E","--","E",null,null,null,null,{"$f":"Table_2[[#This Row],[Column51]]&Table_2[[#This Row],[Column52]]&BU227","v":""}]
[224,null,null,null,null,null,null,null,null,null,null,null,0,null,null,0,null,null,0,null,null,0,null,null,0,null,null,0,null,null,null,0,null,null,null,{"$f":"IF(AG226<Instructions!D255,AG226,SUM(AG226:AI226))","v":0},null,null,null,{"$f":"IF(AK226<Instructions!D254,AK226,SUM(AK226:AM226))","v":0},null,null,null,{"$f":"IF(AO226<Instructions!D253,AO226,SUM(AO226:AQ226))","v":0},"--",0,{"$f":"SUM(Table_2[[#This Row],[Column20]],Table_2[[#This Row],[Column19]],Table_2[[#This Row],[Column18]])","v":0},"HEALTH & PHY. EDU.",{"$f":"(M226/Instructions!$C$23)*100","v":0},{"$f":"(P226/Instructions!$C$24)*100","v":0},{"$f":"(S226/Instructions!$C$25)*100","v":0},{"$f":"(V226/Instructions!$C$26)*100","v":0},{"$f":"(Y226/Instructions!$C$27)*100","v":0},{"$f":"(AB226/Instructions!$C$28)*100","v":0},{"$f":"(AF226/Instructions!$C$29)*100","v":0},{"$f":"(AJ226/Instructions!$C$30)*100","v":0},{"$f":"(AN226/Instructions!$C$31)*100","v":0},0,{"$f":"(AS226/Instructions!$C$33)*100","v":{"$error":"#VALUE!"}},"----","E","E","E","E","E","E","E","E","E","E","--","E",null,null,null,null,{"$f":"Table_2[[#This Row],[Column51]]&Table_2[[#This Row],[Column52]]&BU228","v":""}]
[225,null,null,null,null,null,null,null,null,null,null,null,0,null,null,0,null,null,0,null,null,0,null,null,0,null,null,0,null,null,null,0,null,null,null,{"$f":"IF(AG227<Instructions!D256,AG227,SUM(AG227:AI227))","v":0},null,null,null,{"$f":"IF(AK227<Instructions!D255,AK227,SUM(AK227:AM227))","v":0},null,null,null,{"$f":"IF(AO227<Instructions!D254,AO227,SUM(AO227:AQ227))","v":0},"--",0,{"$f":"SUM(Table_2[[#This Row],[Column20]],Table_2[[#This Row],[Column19]],Table_2[[#This Row],[Column18]])","v":0},"HEALTH & PHY. EDU.",{"$f":"(M227/Instructions!$C$23)*100","v":0},{"$f":"(P227/Instructions!$C$24)*100","v":0},{"$f":"(S227/Instructions!$C$25)*100","v":0},{"$f":"(V227/Instructions!$C$26)*100","v":0},{"$f":"(Y227/Instructions!$C$27)*100","v":0},{"$f":"(AB227/Instructions!$C$28)*100","v":0},{"$f":"(AF227/Instructions!$C$29)*100","v":0},{"$f":"(AJ227/Instructions!$C$30)*100","v":0},{"$f":"(AN227/Instructions!$C$31)*100","v":0},0,{"$f":"(AS227/Instructions!$C$33)*100","v":{"$error":"#VALUE!"}},"----","E","E","E","E","E","E","E","E","E","E","--","E",null,null,null,null,{"$f":"Table_2[[#This Row],[Column51]]&Table_2[[#This Row],[Column52]]&BU229","v":""}]
[226,null,null,null,null,null,null,null,null,null,null,null,0,null,null,0,null,null,0,null,null,0,null,null,0,null,null,0,null,null,null,0,null,null,null,{"$f":"IF(AG228<Instructions!D257,AG228,SUM(AG228:AI228))","v":0},null,null,null,{"$f":"IF(AK228<Instructions!D256,AK228,SUM(AK228:AM228))","v":0},null,null,null,{"$f":"IF(AO228<Instructions!D255,AO228,SUM(AO228:AQ228))","v":0},"--",0,{"$f":"SUM(Table_2[[#This Row],[Column20]],Table_2[[#This Row],[Column19]],Table_2[[#This Row],[Column18]])","v":0},"HEALTH & PHY. EDU.",{"$f":"(M228/Instructions!$C$23)*100","v":0},{"$f":"(P228/Instructions!$C$24)*100","v":0},{"$f":"(S228/Instructions!$C$25)*100","v":0},{"$f":"(V228/Instructions!$C$26)*100","v":0},{"$f":"(Y228/Instructions!$C$27)*100","v":0},{"$f":"(AB228/Instructions!$C$28)*100","v":0},{"$f":"(AF228/Instructions!$C$29)*100","v":0},{"$f":"(AJ228/Instructions!$C$30)*100","v":0},{"$f":"(AN228/Instructions!$C$31)*100","v":0},0,{"$f":"(AS228/Instructions!$C$33)*100","v":{"$error":"#VALUE!"}},"----","E","E","E","E","E","E","E","E","E","E","--","E",null,null,null,null,{"$f":"Table_2[[#This Row],[Column51]]&Table_2[[#This Row],[Column52]]&BU230","v":""}]
[227,null,null,null,null,null,null,null,null,null,null,null,0,null,null,0,null,null,0,null,null,0,null,null,0,null,null,0,null,null,null,0,null,null,null,{"$f":"IF(AG229<Instructions!D258,AG229,SUM(AG229:AI229))","v":0},null,null,null,{"$f":"IF(AK229<Instructions!D257,AK229,SUM(AK229:AM229))","v":0},null,null,null,{"$f":"IF(AO229<Instructions!D256,AO229,SUM(AO229:AQ229))","v":0},"--",0,{"$f":"SUM(Table_2[[#This Row],[Column20]],Table_2[[#This Row],[Column19]],Table_2[[#This Row],[Column18]])","v":0},"HEALTH & PHY. EDU.",{"$f":"(M229/Instructions!$C$23)*100","v":0},{"$f":"(P229/Instructions!$C$24)*100","v":0},{"$f":"(S229/Instructions!$C$25)*100","v":0},{"$f":"(V229/Instructions!$C$26)*100","v":0},{"$f":"(Y229/Instructions!$C$27)*100","v":0},{"$f":"(AB229/Instructions!$C$28)*100","v":0},{"$f":"(AF229/Instructions!$C$29)*100","v":0},{"$f":"(AJ229/Instructions!$C$30)*100","v":0},{"$f":"(AN229/Instructions!$C$31)*100","v":0},0,{"$f":"(AS229/Instructions!$C$33)*100","v":{"$error":"#VALUE!"}},"----","E","E","E","E","E","E","E","E","E","E","--","E",null,null,null,null,{"$f":"Table_2[[#This Row],[Column51]]&Table_2[[#This Row],[Column52]]&BU231","v":""}]
[228,null,null,null,null,null,null,null,null,null,null,null,0,null,null,0,null,null,0,null,null,0,null,null,0,null,null,0,null,null,null,0,null,null,null,{"$f":"IF(AG230<Instructions!D259,AG230,SUM(AG230:AI230))","v":0},null,null,null,{"$f":"IF(AK230<Instructions!D258,AK230,SUM(AK230:AM230))","v":0},null,null,null,{"$f":"IF(AO230<Instructions!D257,AO230,SUM(AO230:AQ230))","v":0},"--",0,{"$f":"SUM(Table_2[[#This Row],[Column20]],Table_2[[#This Row],[Column19]],Table_2[[#This Row],[Column18]])","v":0},"HEALTH & PHY. EDU.",{"$f":"(M230/Instructions!$C$23)*100","v":0},{"$f":"(P230/Instructions!$C$24)*100","v":0},{"$f":"(S230/Instructions!$C$25)*100","v":0},{"$f":"(V230/Instructions!$C$26)*100","v":0},{"$f":"(Y230/Instructions!$C$27)*100","v":0},{"$f":"(AB230/Instructions!$C$28)*100","v":0},{"$f":"(AF230/Instructions!$C$29)*100","v":0},{"$f":"(AJ230/Instructions!$C$30)*100","v":0},{"$f":"(AN230/Instructions!$C$31)*100","v":0},0,{"$f":"(AS230/Instructions!$C$33)*100","v":{"$error":"#VALUE!"}},"----","E","E","E","E","E","E","E","E","E","E","--","E",null,null,null,null,{"$f":"Table_2[[#This Row],[Column51]]&Table_2[[#This Row],[Column52]]&BU232","v":""}]
[229,null,null,null,null,null,null,null,null,null,null,null,0,null,null,0,null,null,0,null,null,0,null,null,0,null,null,0,null,null,null,0,null,null,null,{"$f":"IF(AG231<Instructions!D260,AG231,SUM(AG231:AI231))","v":0},null,null,null,{"$f":"IF(AK231<Instructions!D259,AK231,SUM(AK231:AM231))","v":0},null,null,null,{"$f":"IF(AO231<Instructions!D258,AO231,SUM(AO231:AQ231))","v":0},"--",0,{"$f":"SUM(Table_2[[#This Row],[Column20]],Table_2[[#This Row],[Column19]],Table_2[[#This Row],[Column18]])","v":0},"HEALTH & PHY. EDU.",{"$f":"(M231/Instructions!$C$23)*100","v":0},{"$f":"(P231/Instructions!$C$24)*100","v":0},{"$f":"(S231/Instructions!$C$25)*100","v":0},{"$f":"(V231/Instructions!$C$26)*100","v":0},{"$f":"(Y231/Instructions!$C$27)*100","v":0},{"$f":"(AB231/Instructions!$C$28)*100","v":0},{"$f":"(AF231/Instructions!$C$29)*100","v":0},{"$f":"(AJ231/Instructions!$C$30)*100","v":0},{"$f":"(AN231/Instructions!$C$31)*100","v":0},0,{"$f":"(AS231/Instructions!$C$33)*100","v":{"$error":"#VALUE!"}},"----","E","E","E","E","E","E","E","E","E","E","--","E",null,null,null,null,{"$f":"Table_2[[#This Row],[Column51]]&Table_2[[#This Row],[Column52]]&BU233","v":""}]
[230,null,null,null,null,null,null,null,null,null,null,null,0,null,null,0,null,null,0,null,null,0,null,null,0,null,null,0,null,null,null,0,null,null,null,{"$f":"IF(AG232<Instructions!D261,AG232,SUM(AG232:AI232))","v":0},null,null,null,{"$f":"IF(AK232<Instructions!D260,AK232,SUM(AK232:AM232))","v":0},null,null,null,{"$f":"IF(AO232<Instructions!D259,AO232,SUM(AO232:AQ232))","v":0},"--",0,{"$f":"SUM(Table_2[[#This Row],[Column20]],Table_2[[#This Row],[Column19]],Table_2[[#This Row],[Column18]])","v":0},"HEALTH & PHY. EDU.",{"$f":"(M232/Instructions!$C$23)*100","v":0},{"$f":"(P232/Instructions!$C$24)*100","v":0},{"$f":"(S232/Instructions!$C$25)*100","v":0},{"$f":"(V232/Instructions!$C$26)*100","v":0},{"$f":"(Y232/Instructions!$C$27)*100","v":0},{"$f":"(AB232/Instructions!$C$28)*100","v":0},{"$f":"(AF232/Instructions!$C$29)*100","v":0},{"$f":"(AJ232/Instructions!$C$30)*100","v":0},{"$f":"(AN232/Instructions!$C$31)*100","v":0},0,{"$f":"(AS232/Instructions!$C$33)*100","v":{"$error":"#VALUE!"}},"----","E","E","E","E","E","E","E","E","E","E","--","E",null,null,null,null,{"$f":"Table_2[[#This Row],[Column51]]&Table_2[[#This Row],[Column52]]&BU234","v":""}]
[231,null,null,null,null,null,null,null,null,null,null,null,0,null,null,0,null,null,0,null,null,0,null,null,0,null,null,0,null,null,null,0,null,null,null,{"$f":"IF(AG233<Instructions!D262,AG233,SUM(AG233:AI233))","v":0},null,null,null,{"$f":"IF(AK233<Instructions!D261,AK233,SUM(AK233:AM233))","v":0},null,null,null,{"$f":"IF(AO233<Instructions!D260,AO233,SUM(AO233:AQ233))","v":0},"--",0,{"$f":"SUM(Table_2[[#This Row],[Column20]],Table_2[[#This Row],[Column19]],Table_2[[#This Row],[Column18]])","v":0},"HEALTH & PHY. EDU.",{"$f":"(M233/Instructions!$C$23)*100","v":0},{"$f":"(P233/Instructions!$C$24)*100","v":0},{"$f":"(S233/Instructions!$C$25)*100","v":0},{"$f":"(V233/Instructions!$C$26)*100","v":0},{"$f":"(Y233/Instructions!$C$27)*100","v":0},{"$f":"(AB233/Instructions!$C$28)*100","v":0},{"$f":"(AF233/Instructions!$C$29)*100","v":0},{"$f":"(AJ233/Instructions!$C$30)*100","v":0},{"$f":"(AN233/Instructions!$C$31)*100","v":0},0,{"$f":"(AS233/Instructions!$C$33)*100","v":{"$error":"#VALUE!"}},"----","E","E","E","E","E","E","E","E","E","E","--","E",null,null,null,null,{"$f":"Table_2[[#This Row],[Column51]]&Table_2[[#This Row],[Column52]]&BU235","v":""}]
[232,null,null,null,null,null,null,null,null,null,null,null,0,null,null,0,null,null,0,null,null,0,null,null,0,null,null,0,null,null,null,0,null,null,null,{"$f":"IF(AG234<Instructions!D263,AG234,SUM(AG234:AI234))","v":0},null,null,null,{"$f":"IF(AK234<Instructions!D262,AK234,SUM(AK234:AM234))","v":0},null,null,null,{"$f":"IF(AO234<Instructions!D261,AO234,SUM(AO234:AQ234))","v":0},"--",0,{"$f":"SUM(Table_2[[#This Row],[Column20]],Table_2[[#This Row],[Column19]],Table_2[[#This Row],[Column18]])","v":0},"HEALTH & PHY. EDU.",{"$f":"(M234/Instructions!$C$23)*100","v":0},{"$f":"(P234/Instructions!$C$24)*100","v":0},{"$f":"(S234/Instructions!$C$25)*100","v":0},{"$f":"(V234/Instructions!$C$26)*100","v":0},{"$f":"(Y234/Instructions!$C$27)*100","v":0},{"$f":"(AB234/Instructions!$C$28)*100","v":0},{"$f":"(AF234/Instructions!$C$29)*100","v":0},{"$f":"(AJ234/Instructions!$C$30)*100","v":0},{"$f":"(AN234/Instructions!$C$31)*100","v":0},0,{"$f":"(AS234/Instructions!$C$33)*100","v":{"$error":"#VALUE!"}},"----","E","E","E","E","E","E","E","E","E","E","--","E",null,null,null,null,{"$f":"Table_2[[#This Row],[Column51]]&Table_2[[#This Row],[Column52]]&BU236","v":""}]
[233,null,null,null,null,null,null,null,null,null,null,null,0,null,null,0,null,null,0,null,null,0,null,null,0,null,null,0,null,null,null,0,null,null,null,{"$f":"IF(AG235<Instructions!D264,AG235,SUM(AG235:AI235))","v":0},null,null,null,{"$f":"IF(AK235<Instructions!D263,AK235,SUM(AK235:AM235))","v":0},null,null,null,{"$f":"IF(AO235<Instructions!D262,AO235,SUM(AO235:AQ235))","v":0},"--",0,{"$f":"SUM(Table_2[[#This Row],[Column20]],Table_2[[#This Row],[Column19]],Table_2[[#This Row],[Column18]])","v":0},"HEALTH & PHY. EDU.",{"$f":"(M235/Instructions!$C$23)*100","v":0},{"$f":"(P235/Instructions!$C$24)*100","v":0},{"$f":"(S235/Instructions!$C$25)*100","v":0},{"$f":"(V235/Instructions!$C$26)*100","v":0},{"$f":"(Y235/Instructions!$C$27)*100","v":0},{"$f":"(AB235/Instructions!$C$28)*100","v":0},{"$f":"(AF235/Instructions!$C$29)*100","v":0},{"$f":"(AJ235/Instructions!$C$30)*100","v":0},{"$f":"(AN235/Instructions!$C$31)*100","v":0},0,{"$f":"(AS235/Instructions!$C$33)*100","v":{"$error":"#VALUE!"}},"----","E","E","E","E","E","E","E","E","E","E","--","E",null,null,null,null,{"$f":"Table_2[[#This Row],[Column51]]&Table_2[[#This Row],[Column52]]&BU237","v":""}]
[234,null,null,null,null,null,null,null,null,null,null,null,0,null,null,0,null,null,0,null,null,0,null,null,0,null,null,0,null,null,null,0,null,null,null,{"$f":"IF(AG236<Instructions!D265,AG236,SUM(AG236:AI236))","v":0},null,null,null,{"$f":"IF(AK236<Instructions!D264,AK236,SUM(AK236:AM236))","v":0},null,null,null,{"$f":"IF(AO236<Instructions!D263,AO236,SUM(AO236:AQ236))","v":0},"--",0,{"$f":"SUM(Table_2[[#This Row],[Column20]],Table_2[[#This Row],[Column19]],Table_2[[#This Row],[Column18]])","v":0},"HEALTH & PHY. EDU.",{"$f":"(M236/Instructions!$C$23)*100","v":0},{"$f":"(P236/Instructions!$C$24)*100","v":0},{"$f":"(S236/Instructions!$C$25)*100","v":0},{"$f":"(V236/Instructions!$C$26)*100","v":0},{"$f":"(Y236/Instructions!$C$27)*100","v":0},{"$f":"(AB236/Instructions!$C$28)*100","v":0},{"$f":"(AF236/Instructions!$C$29)*100","v":0},{"$f":"(AJ236/Instructions!$C$30)*100","v":0},{"$f":"(AN236/Instructions!$C$31)*100","v":0},0,{"$f":"(AS236/Instructions!$C$33)*100","v":{"$error":"#VALUE!"}},"----","E","E","E","E","E","E","E","E","E","E","--","E",null,null,null,null,{"$f":"Table_2[[#This Row],[Column51]]&Table_2[[#This Row],[Column52]]&BU238","v":""}]
[235,null,null,null,null,null,null,null,null,null,null,null,0,null,null,0,null,null,0,null,null,0,null,null,0,null,null,0,null,null,null,0,null,null,null,{"$f":"IF(AG237<Instructions!D266,AG237,SUM(AG237:AI237))","v":0},null,null,null,{"$f":"IF(AK237<Instructions!D265,AK237,SUM(AK237:AM237))","v":0},null,null,null,{"$f":"IF(AO237<Instructions!D264,AO237,SUM(AO237:AQ237))","v":0},"--",0,{"$f":"SUM(Table_2[[#This Row],[Column20]],Table_2[[#This Row],[Column19]],Table_2[[#This Row],[Column18]])","v":0},"HEALTH & PHY. EDU.",{"$f":"(M237/Instructions!$C$23)*100","v":0},{"$f":"(P237/Instructions!$C$24)*100","v":0},{"$f":"(S237/Instructions!$C$25)*100","v":0},{"$f":"(V237/Instructions!$C$26)*100","v":0},{"$f":"(Y237/Instructions!$C$27)*100","v":0},{"$f":"(AB237/Instructions!$C$28)*100","v":0},{"$f":"(AF237/Instructions!$C$29)*100","v":0},{"$f":"(AJ237/Instructions!$C$30)*100","v":0},{"$f":"(AN237/Instructions!$C$31)*100","v":0},0,{"$f":"(AS237/Instructions!$C$33)*100","v":{"$error":"#VALUE!"}},"----","E","E","E","E","E","E","E","E","E","E","--","E",null,null,null,null,{"$f":"Table_2[[#This Row],[Column51]]&Table_2[[#This Row],[Column52]]&BU239","v":""}]
[236,null,null,null,null,null,null,null,null,null,null,null,0,null,null,0,null,null,0,null,null,0,null,null,0,null,null,0,null,null,null,0,null,null,null,{"$f":"IF(AG238<Instructions!D267,AG238,SUM(AG238:AI238))","v":0},null,null,null,{"$f":"IF(AK238<Instructions!D266,AK238,SUM(AK238:AM238))","v":0},null,null,null,{"$f":"IF(AO238<Instructions!D265,AO238,SUM(AO238:AQ238))","v":0},"--",0,{"$f":"SUM(Table_2[[#This Row],[Column20]],Table_2[[#This Row],[Column19]],Table_2[[#This Row],[Column18]])","v":0},"HEALTH & PHY. EDU.",{"$f":"(M238/Instructions!$C$23)*100","v":0},{"$f":"(P238/Instructions!$C$24)*100","v":0},{"$f":"(S238/Instructions!$C$25)*100","v":0},{"$f":"(V238/Instructions!$C$26)*100","v":0},{"$f":"(Y238/Instructions!$C$27)*100","v":0},{"$f":"(AB238/Instructions!$C$28)*100","v":0},{"$f":"(AF238/Instructions!$C$29)*100","v":0},{"$f":"(AJ238/Instructions!$C$30)*100","v":0},{"$f":"(AN238/Instructions!$C$31)*100","v":0},0,{"$f":"(AS238/Instructions!$C$33)*100","v":{"$error":"#VALUE!"}},"----","E","E","E","E","E","E","E","E","E","E","--","E",null,null,null,null,{"$f":"Table_2[[#This Row],[Column51]]&Table_2[[#This Row],[Column52]]&BU240","v":""}]
[237,null,null,null,null,null,null,null,null,null,null,null,0,null,null,0,null,null,0,null,null,0,null,null,0,null,null,0,null,null,null,0,null,null,null,{"$f":"IF(AG239<Instructions!D268,AG239,SUM(AG239:AI239))","v":0},null,null,null,{"$f":"IF(AK239<Instructions!D267,AK239,SUM(AK239:AM239))","v":0},null,null,null,{"$f":"IF(AO239<Instructions!D266,AO239,SUM(AO239:AQ239))","v":0},"--",0,{"$f":"SUM(Table_2[[#This Row],[Column20]],Table_2[[#This Row],[Column19]],Table_2[[#This Row],[Column18]])","v":0},"HEALTH & PHY. EDU.",{"$f":"(M239/Instructions!$C$23)*100","v":0},{"$f":"(P239/Instructions!$C$24)*100","v":0},{"$f":"(S239/Instructions!$C$25)*100","v":0},{"$f":"(V239/Instructions!$C$26)*100","v":0},{"$f":"(Y239/Instructions!$C$27)*100","v":0},{"$f":"(AB239/Instructions!$C$28)*100","v":0},{"$f":"(AF239/Instructions!$C$29)*100","v":0},{"$f":"(AJ239/Instructions!$C$30)*100","v":0},{"$f":"(AN239/Instructions!$C$31)*100","v":0},0,{"$f":"(AS239/Instructions!$C$33)*100","v":{"$error":"#VALUE!"}},"----","E","E","E","E","E","E","E","E","E","E","--","E",null,null,null,null,{"$f":"Table_2[[#This Row],[Column51]]&Table_2[[#This Row],[Column52]]&BU241","v":""}]
[238,null,null,null,null,null,null,null,null,null,null,null,0,null,null,0,null,null,0,null,null,0,null,null,0,null,null,0,null,null,null,0,null,null,null,{"$f":"IF(AG240<Instructions!D269,AG240,SUM(AG240:AI240))","v":0},null,null,null,{"$f":"IF(AK240<Instructions!D268,AK240,SUM(AK240:AM240))","v":0},null,null,null,{"$f":"IF(AO240<Instructions!D267,AO240,SUM(AO240:AQ240))","v":0},"--",0,{"$f":"SUM(Table_2[[#This Row],[Column20]],Table_2[[#This Row],[Column19]],Table_2[[#This Row],[Column18]])","v":0},"HEALTH & PHY. EDU.",{"$f":"(M240/Instructions!$C$23)*100","v":0},{"$f":"(P240/Instructions!$C$24)*100","v":0},{"$f":"(S240/Instructions!$C$25)*100","v":0},{"$f":"(V240/Instructions!$C$26)*100","v":0},{"$f":"(Y240/Instructions!$C$27)*100","v":0},{"$f":"(AB240/Instructions!$C$28)*100","v":0},{"$f":"(AF240/Instructions!$C$29)*100","v":0},{"$f":"(AJ240/Instructions!$C$30)*100","v":0},{"$f":"(AN240/Instructions!$C$31)*100","v":0},0,{"$f":"(AS240/Instructions!$C$33)*100","v":{"$error":"#VALUE!"}},"----","E","E","E","E","E","E","E","E","E","E","--","E",null,null,null,null,{"$f":"Table_2[[#This Row],[Column51]]&Table_2[[#This Row],[Column52]]&BU242","v":""}]
[239,null,null,null,null,null,null,null,null,null,null,null,0,null,null,0,null,null,0,null,null,0,null,null,0,null,null,0,null,null,null,0,null,null,null,{"$f":"IF(AG241<Instructions!D270,AG241,SUM(AG241:AI241))","v":0},null,null,null,{"$f":"IF(AK241<Instructions!D269,AK241,SUM(AK241:AM241))","v":0},null,null,null,{"$f":"IF(AO241<Instructions!D268,AO241,SUM(AO241:AQ241))","v":0},"--",0,{"$f":"SUM(Table_2[[#This Row],[Column20]],Table_2[[#This Row],[Column19]],Table_2[[#This Row],[Column18]])","v":0},"HEALTH & PHY. EDU.",{"$f":"(M241/Instructions!$C$23)*100","v":0},{"$f":"(P241/Instructions!$C$24)*100","v":0},{"$f":"(S241/Instructions!$C$25)*100","v":0},{"$f":"(V241/Instructions!$C$26)*100","v":0},{"$f":"(Y241/Instructions!$C$27)*100","v":0},{"$f":"(AB241/Instructions!$C$28)*100","v":0},{"$f":"(AF241/Instructions!$C$29)*100","v":0},{"$f":"(AJ241/Instructions!$C$30)*100","v":0},{"$f":"(AN241/Instructions!$C$31)*100","v":0},0,{"$f":"(AS241/Instructions!$C$33)*100","v":{"$error":"#VALUE!"}},"----","E","E","E","E","E","E","E","E","E","E","--","E",null,null,null,null,{"$f":"Table_2[[#This Row],[Column51]]&Table_2[[#This Row],[Column52]]&BU243","v":""}]
[240,null,null,null,null,null,null,null,null,null,null,null,0,null,null,0,null,null,0,null,null,0,null,null,0,null,null,0,null,null,null,0,null,null,null,{"$f":"IF(AG242<Instructions!D271,AG242,SUM(AG242:AI242))","v":0},null,null,null,{"$f":"IF(AK242<Instructions!D270,AK242,SUM(AK242:AM242))","v":0},null,null,null,{"$f":"IF(AO242<Instructions!D269,AO242,SUM(AO242:AQ242))","v":0},"--",0,{"$f":"SUM(Table_2[[#This Row],[Column20]],Table_2[[#This Row],[Column19]],Table_2[[#This Row],[Column18]])","v":0},"HEALTH & PHY. EDU.",{"$f":"(M242/Instructions!$C$23)*100","v":0},{"$f":"(P242/Instructions!$C$24)*100","v":0},{"$f":"(S242/Instructions!$C$25)*100","v":0},{"$f":"(V242/Instructions!$C$26)*100","v":0},{"$f":"(Y242/Instructions!$C$27)*100","v":0},{"$f":"(AB242/Instructions!$C$28)*100","v":0},{"$f":"(AF242/Instructions!$C$29)*100","v":0},{"$f":"(AJ242/Instructions!$C$30)*100","v":0},{"$f":"(AN242/Instructions!$C$31)*100","v":0},0,{"$f":"(AS242/Instructions!$C$33)*100","v":{"$error":"#VALUE!"}},"----","E","E","E","E","E","E","E","E","E","E","--","E",null,null,null,null,{"$f":"Table_2[[#This Row],[Column51]]&Table_2[[#This Row],[Column52]]&BU244","v":""}]
[241,null,null,null,null,null,null,null,null,null,null,null,0,null,null,0,null,null,0,null,null,0,null,null,0,null,null,0,null,null,null,0,null,null,null,{"$f":"IF(AG243<Instructions!D272,AG243,SUM(AG243:AI243))","v":0},null,null,null,{"$f":"IF(AK243<Instructions!D271,AK243,SUM(AK243:AM243))","v":0},null,null,null,{"$f":"IF(AO243<Instructions!D270,AO243,SUM(AO243:AQ243))","v":0},"--",0,{"$f":"SUM(Table_2[[#This Row],[Column20]],Table_2[[#This Row],[Column19]],Table_2[[#This Row],[Column18]])","v":0},"HEALTH & PHY. EDU.",{"$f":"(M243/Instructions!$C$23)*100","v":0},{"$f":"(P243/Instructions!$C$24)*100","v":0},{"$f":"(S243/Instructions!$C$25)*100","v":0},{"$f":"(V243/Instructions!$C$26)*100","v":0},{"$f":"(Y243/Instructions!$C$27)*100","v":0},{"$f":"(AB243/Instructions!$C$28)*100","v":0},{"$f":"(AF243/Instructions!$C$29)*100","v":0},{"$f":"(AJ243/Instructions!$C$30)*100","v":0},{"$f":"(AN243/Instructions!$C$31)*100","v":0},0,{"$f":"(AS243/Instructions!$C$33)*100","v":{"$error":"#VALUE!"}},"----","E","E","E","E","E","E","E","E","E","E","--","E",null,null,null,null,{"$f":"Table_2[[#This Row],[Column51]]&Table_2[[#This Row],[Column52]]&BU245","v":""}]
[242,null,null,null,null,null,null,null,null,null,null,null,0,null,null,0,null,null,0,null,null,0,null,null,0,null,null,0,null,null,null,0,null,null,null,{"$f":"IF(AG244<Instructions!D273,AG244,SUM(AG244:AI244))","v":0},null,null,null,{"$f":"IF(AK244<Instructions!D272,AK244,SUM(AK244:AM244))","v":0},null,null,null,{"$f":"IF(AO244<Instructions!D271,AO244,SUM(AO244:AQ244))","v":0},"--",0,{"$f":"SUM(Table_2[[#This Row],[Column20]],Table_2[[#This Row],[Column19]],Table_2[[#This Row],[Column18]])","v":0},"HEALTH & PHY. EDU.",{"$f":"(M244/Instructions!$C$23)*100","v":0},{"$f":"(P244/Instructions!$C$24)*100","v":0},{"$f":"(S244/Instructions!$C$25)*100","v":0},{"$f":"(V244/Instructions!$C$26)*100","v":0},{"$f":"(Y244/Instructions!$C$27)*100","v":0},{"$f":"(AB244/Instructions!$C$28)*100","v":0},{"$f":"(AF244/Instructions!$C$29)*100","v":0},{"$f":"(AJ244/Instructions!$C$30)*100","v":0},{"$f":"(AN244/Instructions!$C$31)*100","v":0},0,{"$f":"(AS244/Instructions!$C$33)*100","v":{"$error":"#VALUE!"}},"----","E","E","E","E","E","E","E","E","E","E","--","E",null,null,null,null,{"$f":"Table_2[[#This Row],[Column51]]&Table_2[[#This Row],[Column52]]&BU246","v":""}]
[243,null,null,null,null,null,null,null,null,null,null,null,0,null,null,0,null,null,0,null,null,0,null,null,0,null,null,0,null,null,null,0,null,null,null,{"$f":"IF(AG245<Instructions!D274,AG245,SUM(AG245:AI245))","v":0},null,null,null,{"$f":"IF(AK245<Instructions!D273,AK245,SUM(AK245:AM245))","v":0},null,null,null,{"$f":"IF(AO245<Instructions!D272,AO245,SUM(AO245:AQ245))","v":0},"--",0,{"$f":"SUM(Table_2[[#This Row],[Column20]],Table_2[[#This Row],[Column19]],Table_2[[#This Row],[Column18]])","v":0},"HEALTH & PHY. EDU.",{"$f":"(M245/Instructions!$C$23)*100","v":0},{"$f":"(P245/Instructions!$C$24)*100","v":0},{"$f":"(S245/Instructions!$C$25)*100","v":0},{"$f":"(V245/Instructions!$C$26)*100","v":0},{"$f":"(Y245/Instructions!$C$27)*100","v":0},{"$f":"(AB245/Instructions!$C$28)*100","v":0},{"$f":"(AF245/Instructions!$C$29)*100","v":0},{"$f":"(AJ245/Instructions!$C$30)*100","v":0},{"$f":"(AN245/Instructions!$C$31)*100","v":0},0,{"$f":"(AS245/Instructions!$C$33)*100","v":{"$error":"#VALUE!"}},"----","E","E",{"$f":"IFERROR(IF(AY245>90,\"A+\",IF(AY245>80,\"A\",IF(AY245>70,\"B+\",IF(AY245>60,\"B\",IF(AY245>50,\"C+\",IF(AY245>40,\"C\",IF(AY245>=33,\"D\",\"E\"))))))),\"Abs\")","v":"E"},{"$f":"IFERROR(IF(AZ245>90,\"A+\",IF(AZ245>80,\"A\",IF(AZ245>70,\"B+\",IF(AZ245>60,\"B\",IF(AZ245>50,\"C+\",IF(AZ245>40,\"C\",IF(AZ245>=33,\"D\",\"E\"))))))),\"Abs\")","v":"E"},{"$f":"IFERROR(IF(BA245>90,\"A+\",IF(BA245>80,\"A\",IF(BA245>70,\"B+\",IF(BA245>60,\"B\",IF(BA245>50,\"C+\",IF(BA245>40,\"C\",IF(BA245>=33,\"D\",\"E\"))))))),\"Abs\")","v":"E"},{"$f":"IFERROR(IF(BB245>90,\"A+\",IF(BB245>80,\"A\",IF(BB245>70,\"B+\",IF(BB245>60,\"B\",IF(BB245>50,\"C+\",IF(BB245>40,\"C\",IF(BB245>=33,\"D\",\"E\"))))))),\"Abs\")","v":"E"},{"$f":"IFERROR(IF(BC245>90,\"A+\",IF(BC245>80,\"A\",IF(BC245>70,\"B+\",IF(BC245>60,\"B\",IF(BC245>50,\"C+\",IF(BC245>40,\"C\",IF(BC245>=33,\"D\",\"E\"))))))),\"Abs\")","v":"E"},{"$f":"IFERROR(IF(BD245>90,\"A+\",IF(BD245>80,\"A\",IF(BD245>70,\"B+\",IF(BD245>60,\"B\",IF(BD245>50,\"C+\",IF(BD245>40,\"C\",IF(BD245>=33,\"D\",\"E\"))))))),\"Abs\")","v":"E"},{"$f":"IFERROR(IF(BE245>90,\"A+\",IF(BE245>80,\"A\",IF(BE245>70,\"B+\",IF(BE245>60,\"B\",IF(BE245>50,\"C+\",IF(BE245>40,\"C\",IF(BE245>=33,\"D\",\"E\"))))))),\"Abs\")","v":"E"},{"$f":"IFERROR(IF(BF245>90,\"A+\",IF(BF245>80,\"A\",IF(BF245>70,\"B+\",IF(BF245>60,\"B\",IF(BF245>50,\"C+\",IF(BF245>40,\"C\",IF(BF245>=33,\"D\",\"E\"))))))),\"Abs\")","v":"E"},"--","E",null,null,null,null,{"$f":"Table_2[[#This Row],[Column51]]&Table_2[[#This Row],[Column52]]&BU247","v":""}]
[244,null,null,null,null,null,null,null,null,null,null,null,0,null,null,0,null,null,0,null,null,0,null,null,0,null,null,0,null,null,null,0,null,null,null,{"$f":"IF(AG246<Instructions!D275,AG246,SUM(AG246:AI246))","v":0},null,null,null,{"$f":"IF(AK246<Instructions!D274,AK246,SUM(AK246:AM246))","v":0},null,null,null,{"$f":"IF(AO246<Instructions!D273,AO246,SUM(AO246:AQ246))","v":0},"--",0,{"$f":"SUM(Table_2[[#This Row],[Column20]],Table_2[[#This Row],[Column19]],Table_2[[#This Row],[Column18]])","v":0},"HEALTH & PHY. EDU.",{"$f":"(M246/Instructions!$C$23)*100","v":0},{"$f":"(P246/Instructions!$C$24)*100","v":0},{"$f":"(S246/Instructions!$C$25)*100","v":0},{"$f":"(V246/Instructions!$C$26)*100","v":0},{"$f":"(Y246/Instructions!$C$27)*100","v":0},{"$f":"(AB246/Instructions!$C$28)*100","v":0},{"$f":"(AF246/Instructions!$C$29)*100","v":0},{"$f":"(AJ246/Instructions!$C$30)*100","v":0},{"$f":"(AN246/Instructions!$C$31)*100","v":0},0,{"$f":"(AS246/Instructions!$C$33)*100","v":{"$error":"#VALUE!"}},"----","E","E","E","E","E","E","E","E","E","E","--","E",null,null,null,null,{"$f":"Table_2[[#This Row],[Column51]]&Table_2[[#This Row],[Column52]]&BU248","v":""}]
[245,null,null,null,null,null,null,null,null,null,null,null,0,null,null,0,null,null,0,null,null,0,null,null,0,null,null,0,null,null,null,0,null,null,null,{"$f":"IF(AG247<Instructions!D276,AG247,SUM(AG247:AI247))","v":0},null,null,null,{"$f":"IF(AK247<Instructions!D275,AK247,SUM(AK247:AM247))","v":0},null,null,null,{"$f":"IF(AO247<Instructions!D274,AO247,SUM(AO247:AQ247))","v":0},"--",0,{"$f":"SUM(Table_2[[#This Row],[Column20]],Table_2[[#This Row],[Column19]],Table_2[[#This Row],[Column18]])","v":0},"HEALTH & PHY. EDU.",{"$f":"(M247/Instructions!$C$23)*100","v":0},{"$f":"(P247/Instructions!$C$24)*100","v":0},{"$f":"(S247/Instructions!$C$25)*100","v":0},{"$f":"(V247/Instructions!$C$26)*100","v":0},{"$f":"(Y247/Instructions!$C$27)*100","v":0},{"$f":"(AB247/Instructions!$C$28)*100","v":0},{"$f":"(AF247/Instructions!$C$29)*100","v":0},{"$f":"(AJ247/Instructions!$C$30)*100","v":0},{"$f":"(AN247/Instructions!$C$31)*100","v":0},0,{"$f":"(AS247/Instructions!$C$33)*100","v":{"$error":"#VALUE!"}},"----","E","E","E","E","E","E","E","E","E","E","--","E",null,null,null,null,{"$f":"Table_2[[#This Row],[Column51]]&Table_2[[#This Row],[Column52]]&BU249","v":""}]
[246,null,null,null,null,null,null,null,null,null,null,null,0,null,null,0,null,null,0,null,null,0,null,null,0,null,null,0,null,null,null,0,null,null,null,{"$f":"IF(AG248<Instructions!D277,AG248,SUM(AG248:AI248))","v":0},null,null,null,{"$f":"IF(AK248<Instructions!D276,AK248,SUM(AK248:AM248))","v":0},null,null,null,{"$f":"IF(AO248<Instructions!D275,AO248,SUM(AO248:AQ248))","v":0},"--",0,{"$f":"SUM(Table_2[[#This Row],[Column20]],Table_2[[#This Row],[Column19]],Table_2[[#This Row],[Column18]])","v":0},"HEALTH & PHY. EDU.",{"$f":"(M248/Instructions!$C$23)*100","v":0},{"$f":"(P248/Instructions!$C$24)*100","v":0},{"$f":"(S248/Instructions!$C$25)*100","v":0},{"$f":"(V248/Instructions!$C$26)*100","v":0},{"$f":"(Y248/Instructions!$C$27)*100","v":0},{"$f":"(AB248/Instructions!$C$28)*100","v":0},{"$f":"(AF248/Instructions!$C$29)*100","v":0},{"$f":"(AJ248/Instructions!$C$30)*100","v":0},{"$f":"(AN248/Instructions!$C$31)*100","v":0},0,{"$f":"(AS248/Instructions!$C$33)*100","v":{"$error":"#VALUE!"}},"----","E","E","E","E","E","E","E","E","E","E","--","E",null,null,null,null,{"$f":"Table_2[[#This Row],[Column51]]&Table_2[[#This Row],[Column52]]&BU250","v":""}]
[247,null,null,null,null,null,null,null,null,null,null,null,0,null,null,0,null,null,0,null,null,0,null,null,0,null,null,0,null,null,null,0,null,null,null,{"$f":"IF(AG249<Instructions!D278,AG249,SUM(AG249:AI249))","v":0},null,null,null,{"$f":"IF(AK249<Instructions!D277,AK249,SUM(AK249:AM249))","v":0},null,null,null,{"$f":"IF(AO249<Instructions!D276,AO249,SUM(AO249:AQ249))","v":0},"--",0,{"$f":"SUM(Table_2[[#This Row],[Column20]],Table_2[[#This Row],[Column19]],Table_2[[#This Row],[Column18]])","v":0},"HEALTH & PHY. EDU.",{"$f":"(M249/Instructions!$C$23)*100","v":0},{"$f":"(P249/Instructions!$C$24)*100","v":0},{"$f":"(S249/Instructions!$C$25)*100","v":0},{"$f":"(V249/Instructions!$C$26)*100","v":0},{"$f":"(Y249/Instructions!$C$27)*100","v":0},{"$f":"(AB249/Instructions!$C$28)*100","v":0},{"$f":"(AF249/Instructions!$C$29)*100","v":0},{"$f":"(AJ249/Instructions!$C$30)*100","v":0},{"$f":"(AN249/Instructions!$C$31)*100","v":0},0,{"$f":"(AS249/Instructions!$C$33)*100","v":{"$error":"#VALUE!"}},"----","E","E","E","E","E","E","E","E","E","E","--","E",null,null,null,null,{"$f":"Table_2[[#This Row],[Column51]]&Table_2[[#This Row],[Column52]]&BU251","v":""}]
[248,null,null,null,null,null,null,null,null,null,null,null,0,null,null,0,null,null,0,null,null,0,null,null,0,null,null,0,null,null,null,0,null,null,null,{"$f":"IF(AG250<Instructions!D279,AG250,SUM(AG250:AI250))","v":0},null,null,null,{"$f":"IF(AK250<Instructions!D278,AK250,SUM(AK250:AM250))","v":0},null,null,null,{"$f":"IF(AO250<Instructions!D277,AO250,SUM(AO250:AQ250))","v":0},"--",0,{"$f":"SUM(Table_2[[#This Row],[Column20]],Table_2[[#This Row],[Column19]],Table_2[[#This Row],[Column18]])","v":0},"HEALTH & PHY. EDU.",{"$f":"(M250/Instructions!$C$23)*100","v":0},{"$f":"(P250/Instructions!$C$24)*100","v":0},{"$f":"(S250/Instructions!$C$25)*100","v":0},{"$f":"(V250/Instructions!$C$26)*100","v":0},{"$f":"(Y250/Instructions!$C$27)*100","v":0},{"$f":"(AB250/Instructions!$C$28)*100","v":0},{"$f":"(AF250/Instructions!$C$29)*100","v":0},{"$f":"(AJ250/Instructions!$C$30)*100","v":0},{"$f":"(AN250/Instructions!$C$31)*100","v":0},0,{"$f":"(AS250/Instructions!$C$33)*100","v":{"$error":"#VALUE!"}},"----","E","E","E","E","E","E","E","E","E","E","--","E",null,null,null,null,{"$f":"Table_2[[#This Row],[Column51]]&Table_2[[#This Row],[Column52]]&BU252","v":""}]
[249,null,null,null,null,null,null,null,null,null,null,null,0,null,null,0,null,null,0,null,null,0,null,null,0,null,null,0,null,null,null,0,null,null,null,{"$f":"IF(AG251<Instructions!D280,AG251,SUM(AG251:AI251))","v":0},null,null,null,{"$f":"IF(AK251<Instructions!D279,AK251,SUM(AK251:AM251))","v":0},null,null,null,{"$f":"IF(AO251<Instructions!D278,AO251,SUM(AO251:AQ251))","v":0},"--",0,{"$f":"SUM(Table_2[[#This Row],[Column20]],Table_2[[#This Row],[Column19]],Table_2[[#This Row],[Column18]])","v":0},"HEALTH & PHY. EDU.",{"$f":"(M251/Instructions!$C$23)*100","v":0},{"$f":"(P251/Instructions!$C$24)*100","v":0},{"$f":"(S251/Instructions!$C$25)*100","v":0},{"$f":"(V251/Instructions!$C$26)*100","v":0},{"$f":"(Y251/Instructions!$C$27)*100","v":0},{"$f":"(AB251/Instructions!$C$28)*100","v":0},{"$f":"(AF251/Instructions!$C$29)*100","v":0},{"$f":"(AJ251/Instructions!$C$30)*100","v":0},{"$f":"(AN251/Instructions!$C$31)*100","v":0},0,{"$f":"(AS251/Instructions!$C$33)*100","v":{"$error":"#VALUE!"}},"----","E","E","E","E","E","E","E","E","E","E","--","E",null,null,null,null,{"$f":"Table_2[[#This Row],[Column51]]&Table_2[[#This Row],[Column52]]&BU253","v":""}]
[250,null,null,null,null,null,null,null,null,null,null,null,0,null,null,0,null,null,0,null,null,0,null,null,0,null,null,0,null,null,null,0,null,null,null,{"$f":"IF(AG252<Instructions!D281,AG252,SUM(AG252:AI252))","v":0},null,null,null,{"$f":"IF(AK252<Instructions!D280,AK252,SUM(AK252:AM252))","v":0},null,null,null,{"$f":"IF(AO252<Instructions!D279,AO252,SUM(AO252:AQ252))","v":0},"--",0,{"$f":"SUM(Table_2[[#This Row],[Column20]],Table_2[[#This Row],[Column19]],Table_2[[#This Row],[Column18]])","v":0},"HEALTH & PHY. EDU.",{"$f":"(M252/Instructions!$C$23)*100","v":0},{"$f":"(P252/Instructions!$C$24)*100","v":0},{"$f":"(S252/Instructions!$C$25)*100","v":0},{"$f":"(V252/Instructions!$C$26)*100","v":0},{"$f":"(Y252/Instructions!$C$27)*100","v":0},{"$f":"(AB252/Instructions!$C$28)*100","v":0},{"$f":"(AF252/Instructions!$C$29)*100","v":0},{"$f":"(AJ252/Instructions!$C$30)*100","v":0},{"$f":"(AN252/Instructions!$C$31)*100","v":0},0,{"$f":"(AS252/Instructions!$C$33)*100","v":{"$error":"#VALUE!"}},"----","E","E","E","E","E","E","E","E","E","E","--","E",null,null,null,null,{"$f":"Table_2[[#This Row],[Column51]]&Table_2[[#This Row],[Column52]]&BU254","v":""}]
[251,null,null,null,null,null,null,null,null,null,null,null,0,null,null,0,null,null,0,null,null,0,null,null,0,null,null,0,null,null,null,0,null,null,null,{"$f":"IF(AG253<Instructions!D282,AG253,SUM(AG253:AI253))","v":0},null,null,null,{"$f":"IF(AK253<Instructions!D281,AK253,SUM(AK253:AM253))","v":0},null,null,null,{"$f":"IF(AO253<Instructions!D280,AO253,SUM(AO253:AQ253))","v":0},"--",0,{"$f":"SUM(Table_2[[#This Row],[Column20]],Table_2[[#This Row],[Column19]],Table_2[[#This Row],[Column18]])","v":0},"HEALTH & PHY. EDU.",{"$f":"(M253/Instructions!$C$23)*100","v":0},{"$f":"(P253/Instructions!$C$24)*100","v":0},{"$f":"(S253/Instructions!$C$25)*100","v":0},{"$f":"(V253/Instructions!$C$26)*100","v":0},{"$f":"(Y253/Instructions!$C$27)*100","v":0},{"$f":"(AB253/Instructions!$C$28)*100","v":0},{"$f":"(AF253/Instructions!$C$29)*100","v":0},{"$f":"(AJ253/Instructions!$C$30)*100","v":0},{"$f":"(AN253/Instructions!$C$31)*100","v":0},0,{"$f":"(AS253/Instructions!$C$33)*100","v":{"$error":"#VALUE!"}},"----","E","E","E","E","E","E","E","E","E","E","--","E",null,null,null,null,{"$f":"Table_2[[#This Row],[Column51]]&Table_2[[#This Row],[Column52]]&BU255","v":""}]
[252,null,null,null,null,null,null,null,null,null,null,null,0,null,null,0,null,null,0,null,null,0,null,null,0,null,null,0,null,null,null,0,null,null,null,{"$f":"IF(AG254<Instructions!D283,AG254,SUM(AG254:AI254))","v":0},null,null,null,{"$f":"IF(AK254<Instructions!D282,AK254,SUM(AK254:AM254))","v":0},null,null,null,{"$f":"IF(AO254<Instructions!D281,AO254,SUM(AO254:AQ254))","v":0},"--",0,{"$f":"SUM(Table_2[[#This Row],[Column20]],Table_2[[#This Row],[Column19]],Table_2[[#This Row],[Column18]])","v":0},"HEALTH & PHY. EDU.",{"$f":"(M254/Instructions!$C$23)*100","v":0},{"$f":"(P254/Instructions!$C$24)*100","v":0},{"$f":"(S254/Instructions!$C$25)*100","v":0},{"$f":"(V254/Instructions!$C$26)*100","v":0},{"$f":"(Y254/Instructions!$C$27)*100","v":0},{"$f":"(AB254/Instructions!$C$28)*100","v":0},{"$f":"(AF254/Instructions!$C$29)*100","v":0},{"$f":"(AJ254/Instructions!$C$30)*100","v":0},{"$f":"(AN254/Instructions!$C$31)*100","v":0},0,{"$f":"(AS254/Instructions!$C$33)*100","v":{"$error":"#VALUE!"}},"----","E","E","E","E","E","E","E","E","E","E","--","E",null,null,null,null,{"$f":"Table_2[[#This Row],[Column51]]&Table_2[[#This Row],[Column52]]&BU256","v":""}]
[253,null,null,null,null,null,null,null,null,null,null,null,0,null,null,0,null,null,0,null,null,0,null,null,0,null,null,0,null,null,null,0,null,null,null,{"$f":"IF(AG255<Instructions!D284,AG255,SUM(AG255:AI255))","v":0},null,null,null,{"$f":"IF(AK255<Instructions!D283,AK255,SUM(AK255:AM255))","v":0},null,null,null,{"$f":"IF(AO255<Instructions!D282,AO255,SUM(AO255:AQ255))","v":0},"--",0,{"$f":"SUM(Table_2[[#This Row],[Column20]],Table_2[[#This Row],[Column19]],Table_2[[#This Row],[Column18]])","v":0},"HEALTH & PHY. EDU.",{"$f":"(M255/Instructions!$C$23)*100","v":0},{"$f":"(P255/Instructions!$C$24)*100","v":0},{"$f":"(S255/Instructions!$C$25)*100","v":0},{"$f":"(V255/Instructions!$C$26)*100","v":0},{"$f":"(Y255/Instructions!$C$27)*100","v":0},{"$f":"(AB255/Instructions!$C$28)*100","v":0},{"$f":"(AF255/Instructions!$C$29)*100","v":0},{"$f":"(AJ255/Instructions!$C$30)*100","v":0},{"$f":"(AN255/Instructions!$C$31)*100","v":0},0,{"$f":"(AS255/Instructions!$C$33)*100","v":{"$error":"#VALUE!"}},"----","E","E","E","E","E","E","E","E","E","E","--","E",null,null,null,null,{"$f":"Table_2[[#This Row],[Column51]]&Table_2[[#This Row],[Column52]]&BU257","v":""}]
[254,null,null,null,null,null,null,null,null,null,null,null,0,null,null,0,null,null,0,null,null,0,null,null,0,null,null,0,null,null,null,0,null,null,null,{"$f":"IF(AG256<Instructions!D285,AG256,SUM(AG256:AI256))","v":0},null,null,null,{"$f":"IF(AK256<Instructions!D284,AK256,SUM(AK256:AM256))","v":0},null,null,null,{"$f":"IF(AO256<Instructions!D283,AO256,SUM(AO256:AQ256))","v":0},"--",0,{"$f":"SUM(Table_2[[#This Row],[Column20]],Table_2[[#This Row],[Column19]],Table_2[[#This Row],[Column18]])","v":0},"HEALTH & PHY. EDU.",{"$f":"(M256/Instructions!$C$23)*100","v":0},{"$f":"(P256/Instructions!$C$24)*100","v":0},{"$f":"(S256/Instructions!$C$25)*100","v":0},{"$f":"(V256/Instructions!$C$26)*100","v":0},{"$f":"(Y256/Instructions!$C$27)*100","v":0},{"$f":"(AB256/Instructions!$C$28)*100","v":0},{"$f":"(AF256/Instructions!$C$29)*100","v":0},{"$f":"(AJ256/Instructions!$C$30)*100","v":0},{"$f":"(AN256/Instructions!$C$31)*100","v":0},0,{"$f":"(AS256/Instructions!$C$33)*100","v":{"$error":"#VALUE!"}},"----","E","E","E","E","E","E","E","E","E","E","--","E",null,null,null,null,{"$f":"Table_2[[#This Row],[Column51]]&Table_2[[#This Row],[Column52]]&BU258","v":""}]
[255,null,null,null,null,null,null,null,null,null,null,null,0,null,null,0,null,null,0,null,null,0,null,null,0,null,null,0,null,null,null,0,null,null,null,{"$f":"IF(AG257<Instructions!D286,AG257,SUM(AG257:AI257))","v":0},null,null,null,{"$f":"IF(AK257<Instructions!D285,AK257,SUM(AK257:AM257))","v":0},null,null,null,{"$f":"IF(AO257<Instructions!D284,AO257,SUM(AO257:AQ257))","v":0},"--",0,{"$f":"SUM(Table_2[[#This Row],[Column20]],Table_2[[#This Row],[Column19]],Table_2[[#This Row],[Column18]])","v":0},"HEALTH & PHY. EDU.",{"$f":"(M257/Instructions!$C$23)*100","v":0},{"$f":"(P257/Instructions!$C$24)*100","v":0},{"$f":"(S257/Instructions!$C$25)*100","v":0},{"$f":"(V257/Instructions!$C$26)*100","v":0},{"$f":"(Y257/Instructions!$C$27)*100","v":0},{"$f":"(AB257/Instructions!$C$28)*100","v":0},{"$f":"(AF257/Instructions!$C$29)*100","v":0},{"$f":"(AJ257/Instructions!$C$30)*100","v":0},{"$f":"(AN257/Instructions!$C$31)*100","v":0},0,{"$f":"(AS257/Instructions!$C$33)*100","v":{"$error":"#VALUE!"}},"----","E","E","E","E","E","E","E","E","E","E","--","E",null,null,null,null,{"$f":"Table_2[[#This Row],[Column51]]&Table_2[[#This Row],[Column52]]&BU259","v":""}]
[256,null,null,null,null,null,null,null,null,null,null,null,0,null,null,0,null,null,0,null,null,0,null,null,0,null,null,0,null,null,null,0,null,null,null,{"$f":"IF(AG258<Instructions!D287,AG258,SUM(AG258:AI258))","v":0},null,null,null,{"$f":"IF(AK258<Instructions!D286,AK258,SUM(AK258:AM258))","v":0},null,null,null,{"$f":"IF(AO258<Instructions!D285,AO258,SUM(AO258:AQ258))","v":0},"--",0,{"$f":"SUM(Table_2[[#This Row],[Column20]],Table_2[[#This Row],[Column19]],Table_2[[#This Row],[Column18]])","v":0},"HEALTH & PHY. EDU.",{"$f":"(M258/Instructions!$C$23)*100","v":0},{"$f":"(P258/Instructions!$C$24)*100","v":0},{"$f":"(S258/Instructions!$C$25)*100","v":0},{"$f":"(V258/Instructions!$C$26)*100","v":0},{"$f":"(Y258/Instructions!$C$27)*100","v":0},{"$f":"(AB258/Instructions!$C$28)*100","v":0},{"$f":"(AF258/Instructions!$C$29)*100","v":0},{"$f":"(AJ258/Instructions!$C$30)*100","v":0},{"$f":"(AN258/Instructions!$C$31)*100","v":0},0,{"$f":"(AS258/Instructions!$C$33)*100","v":{"$error":"#VALUE!"}},"----","E","E","E","E","E","E","E","E","E","E","--","E",null,null,null,null,{"$f":"Table_2[[#This Row],[Column51]]&Table_2[[#This Row],[Column52]]&BU260","v":""}]
[257,null,null,null,null,null,null,null,null,null,null,null,0,null,null,0,null,null,0,null,null,0,null,null,0,null,null,0,null,null,null,0,null,null,null,{"$f":"IF(AG259<Instructions!D288,AG259,SUM(AG259:AI259))","v":0},null,null,null,{"$f":"IF(AK259<Instructions!D287,AK259,SUM(AK259:AM259))","v":0},null,null,null,{"$f":"IF(AO259<Instructions!D286,AO259,SUM(AO259:AQ259))","v":0},"--",0,{"$f":"SUM(Table_2[[#This Row],[Column20]],Table_2[[#This Row],[Column19]],Table_2[[#This Row],[Column18]])","v":0},"HEALTH & PHY. EDU.",{"$f":"(M259/Instructions!$C$23)*100","v":0},{"$f":"(P259/Instructions!$C$24)*100","v":0},{"$f":"(S259/Instructions!$C$25)*100","v":0},{"$f":"(V259/Instructions!$C$26)*100","v":0},{"$f":"(Y259/Instructions!$C$27)*100","v":0},{"$f":"(AB259/Instructions!$C$28)*100","v":0},{"$f":"(AF259/Instructions!$C$29)*100","v":0},{"$f":"(AJ259/Instructions!$C$30)*100","v":0},{"$f":"(AN259/Instructions!$C$31)*100","v":0},0,{"$f":"(AS259/Instructions!$C$33)*100","v":{"$error":"#VALUE!"}},"----","E","E","E","E","E","E","E","E","E","E","--","E",null,null,null,null,{"$f":"Table_2[[#This Row],[Column51]]&Table_2[[#This Row],[Column52]]&BU261","v":""}]
[258,null,null,null,null,null,null,null,null,null,null,null,{"$f":"IF(K260<33,K260,SUM(K260:L260))","v":0},null,null,{"$f":"IF(N260<20,N260,SUM(N260:O260))","v":0},null,null,{"$f":"IF(Q260<20,Q260,SUM(Q260:R260))","v":0},null,null,{"$f":"IF(T260<20,T260,SUM(T260:U260))","v":0},null,null,{"$f":"IF(W260<20,W260,SUM(W260:X260))","v":0},null,null,{"$f":"IF(Z260<20,Z260,SUM(Z260:AA260))","v":0},null,null,null,{"$f":"IF(AC260<10,AC260,SUM(AC260:AE260))","v":0},null,null,null,{"$f":"IF(AG260<Instructions!D289,AG260,SUM(AG260:AI260))","v":0},null,null,null,{"$f":"IF(AK260<Instructions!D288,AK260,SUM(AK260:AM260))","v":0},null,null,null,{"$f":"IF(AO260<Instructions!D287,AO260,SUM(AO260:AQ260))","v":0},{"$f":"IF(MIN(M260,P260,S260,V260,Y260,AB260)>=33,SUM(M260,P260,S260,V260,Y260,AB260),\"--\")","v":"--"},{"$f":"IF(AS260=\"--\",0,AS260)","v":0},{"$f":"SUM(Table_2[[#This Row],[Column20]],Table_2[[#This Row],[Column19]],Table_2[[#This Row],[Column18]])","v":0},{"$f":"IF(N(AJ260)>0,$AG$1,IF(N(AN260)>0,$AK$1,$AO$1))","v":"HEALTH & PHY. EDU."},{"$f":"(M260/Instructions!$C$23)*100","v":0},{"$f":"(P260/Instructions!$C$24)*100","v":0},{"$f":"(S260/Instructions!$C$25)*100","v":0},{"$f":"(V260/Instructions!$C$26)*100","v":0},{"$f":"(Y260/Instructions!$C$27)*100","v":0},{"$f":"(AB260/Instructions!$C$28)*100","v":0},{"$f":"(AF260/Instructions!$C$29)*100","v":0},{"$f":"(AJ260/Instructions!$C$30)*100","v":0},{"$f":"(AN260/Instructions!$C$31)*100","v":0},{"$f":"(AR260/100)*100","v":0},{"$f":"(AS260/Instructions!$C$33)*100","v":{"$error":"#VALUE!"}},{"$f":"IF(AND(AW260>=33,AX260>=33,AY260>=33,AZ260>=33,BA260>=33,BB260>=33),\"PASS\",\"----\")","v":"----"},"E","E","E","E","E","E","E","E","E","E",{"$f":"IFERROR(IF(BG260>90,\"A+\",IF(BG260>80,\"A\",IF(BG260>70,\"B+\",IF(BG260>60,\"B\",IF(BG260>50,\"C+\",IF(BG260>40,\"C\",IF(BG260>=33,\"D\",\"E\"))))))),\"--\")","v":"--"},{"$f":"IFERROR(IF(BF260>90,\"A+\",IF(BF260>80,\"A\",IF(BF260>70,\"B+\",IF(BF260>60,\"B\",IF(BF260>50,\"C+\",IF(BF260>40,\"C\",IF(BF260>=33,\"D\",\"E\"))))))),\"Abs\")","v":"E"},null,null,null,null,{"$f":"Table_2[[#This Row],[Column51]]&Table_2[[#This Row],[Column52]]&BU262","v":""}]
[259,null,null,null,null,null,null,null,null,null,null,null,0,null,null,0,null,null,0,null,null,0,null,null,0,null,null,0,null,null,null,0,null,null,null,{"$f":"IF(AG261<Instructions!D290,AG261,SUM(AG261:AI261))","v":0},null,null,null,{"$f":"IF(AK261<Instructions!D289,AK261,SUM(AK261:AM261))","v":0},null,null,null,{"$f":"IF(AO261<Instructions!D288,AO261,SUM(AO261:AQ261))","v":0},"--",0,{"$f":"SUM(Table_2[[#This Row],[Column20]],Table_2[[#This Row],[Column19]],Table_2[[#This Row],[Column18]])","v":0},"HEALTH & PHY. EDU.",{"$f":"(M261/Instructions!$C$23)*100","v":0},{"$f":"(P261/Instructions!$C$24)*100","v":0},{"$f":"(S261/Instructions!$C$25)*100","v":0},{"$f":"(V261/Instructions!$C$26)*100","v":0},{"$f":"(Y261/Instructions!$C$27)*100","v":0},{"$f":"(AB261/Instructions!$C$28)*100","v":0},{"$f":"(AF261/Instructions!$C$29)*100","v":0},{"$f":"(AJ261/Instructions!$C$30)*100","v":0},{"$f":"(AN261/Instructions!$C$31)*100","v":0},0,{"$f":"(AS261/Instructions!$C$33)*100","v":{"$error":"#VALUE!"}},"----","E","E","E","E","E","E","E","E","E","E","--","E",null,null,null,null,{"$f":"Table_2[[#This Row],[Column51]]&Table_2[[#This Row],[Column52]]&BU263","v":""}]
[260,null,null,null,null,null,null,null,null,null,null,null,0,null,null,0,null,null,0,null,null,0,null,null,0,null,null,0,null,null,null,0,null,null,null,{"$f":"IF(AG262<Instructions!D291,AG262,SUM(AG262:AI262))","v":0},null,null,null,{"$f":"IF(AK262<Instructions!D290,AK262,SUM(AK262:AM262))","v":0},null,null,null,{"$f":"IF(AO262<Instructions!D289,AO262,SUM(AO262:AQ262))","v":0},"--",0,{"$f":"SUM(Table_2[[#This Row],[Column20]],Table_2[[#This Row],[Column19]],Table_2[[#This Row],[Column18]])","v":0},"HEALTH & PHY. EDU.",{"$f":"(M262/Instructions!$C$23)*100","v":0},{"$f":"(P262/Instructions!$C$24)*100","v":0},{"$f":"(S262/Instructions!$C$25)*100","v":0},{"$f":"(V262/Instructions!$C$26)*100","v":0},{"$f":"(Y262/Instructions!$C$27)*100","v":0},{"$f":"(AB262/Instructions!$C$28)*100","v":0},{"$f":"(AF262/Instructions!$C$29)*100","v":0},{"$f":"(AJ262/Instructions!$C$30)*100","v":0},{"$f":"(AN262/Instructions!$C$31)*100","v":0},0,{"$f":"(AS262/Instructions!$C$33)*100","v":{"$error":"#VALUE!"}},"----","E","E","E","E","E","E","E","E","E","E","--","E",null,null,null,null,{"$f":"Table_2[[#This Row],[Column51]]&Table_2[[#This Row],[Column52]]&BU264","v":""}]
[261,null,null,null,null,null,null,null,null,null,null,null,0,null,null,0,null,null,0,null,null,0,null,null,0,null,null,0,null,null,null,0,null,null,null,{"$f":"IF(AG263<Instructions!D292,AG263,SUM(AG263:AI263))","v":0},null,null,null,{"$f":"IF(AK263<Instructions!D291,AK263,SUM(AK263:AM263))","v":0},null,null,null,{"$f":"IF(AO263<Instructions!D290,AO263,SUM(AO263:AQ263))","v":0},"--",0,{"$f":"SUM(Table_2[[#This Row],[Column20]],Table_2[[#This Row],[Column19]],Table_2[[#This Row],[Column18]])","v":0},"HEALTH & PHY. EDU.",{"$f":"(M263/Instructions!$C$23)*100","v":0},{"$f":"(P263/Instructions!$C$24)*100","v":0},{"$f":"(S263/Instructions!$C$25)*100","v":0},{"$f":"(V263/Instructions!$C$26)*100","v":0},{"$f":"(Y263/Instructions!$C$27)*100","v":0},{"$f":"(AB263/Instructions!$C$28)*100","v":0},{"$f":"(AF263/Instructions!$C$29)*100","v":0},{"$f":"(AJ263/Instructions!$C$30)*100","v":0},{"$f":"(AN263/Instructions!$C$31)*100","v":0},0,{"$f":"(AS263/Instructions!$C$33)*100","v":{"$error":"#VALUE!"}},"----","E","E","E","E","E","E","E","E","E","E","--","E",null,null,null,null,{"$f":"Table_2[[#This Row],[Column51]]&Table_2[[#This Row],[Column52]]&BU265","v":""}]
[262,null,null,null,null,null,null,null,null,null,null,null,0,null,null,0,null,null,0,null,null,0,null,null,0,null,null,0,null,null,null,0,null,null,null,{"$f":"IF(AG264<Instructions!D293,AG264,SUM(AG264:AI264))","v":0},null,null,null,{"$f":"IF(AK264<Instructions!D292,AK264,SUM(AK264:AM264))","v":0},null,null,null,{"$f":"IF(AO264<Instructions!D291,AO264,SUM(AO264:AQ264))","v":0},"--",0,{"$f":"SUM(Table_2[[#This Row],[Column20]],Table_2[[#This Row],[Column19]],Table_2[[#This Row],[Column18]])","v":0},"HEALTH & PHY. EDU.",{"$f":"(M264/Instructions!$C$23)*100","v":0},{"$f":"(P264/Instructions!$C$24)*100","v":0},{"$f":"(S264/Instructions!$C$25)*100","v":0},{"$f":"(V264/Instructions!$C$26)*100","v":0},{"$f":"(Y264/Instructions!$C$27)*100","v":0},{"$f":"(AB264/Instructions!$C$28)*100","v":0},{"$f":"(AF264/Instructions!$C$29)*100","v":0},{"$f":"(AJ264/Instructions!$C$30)*100","v":0},{"$f":"(AN264/Instructions!$C$31)*100","v":0},0,{"$f":"(AS264/Instructions!$C$33)*100","v":{"$error":"#VALUE!"}},"----","E","E","E","E","E","E","E","E","E","E","--","E",null,null,null,null,{"$f":"Table_2[[#This Row],[Column51]]&Table_2[[#This Row],[Column52]]&BU266","v":""}]
[263,null,null,null,null,null,null,null,null,null,null,null,0,null,null,0,null,null,0,null,null,0,null,null,0,null,null,0,null,null,null,0,null,null,null,{"$f":"IF(AG265<Instructions!D294,AG265,SUM(AG265:AI265))","v":0},null,null,null,{"$f":"IF(AK265<Instructions!D293,AK265,SUM(AK265:AM265))","v":0},null,null,null,{"$f":"IF(AO265<Instructions!D292,AO265,SUM(AO265:AQ265))","v":0},"--",0,{"$f":"SUM(Table_2[[#This Row],[Column20]],Table_2[[#This Row],[Column19]],Table_2[[#This Row],[Column18]])","v":0},"HEALTH & PHY. EDU.",{"$f":"(M265/Instructions!$C$23)*100","v":0},{"$f":"(P265/Instructions!$C$24)*100","v":0},{"$f":"(S265/Instructions!$C$25)*100","v":0},{"$f":"(V265/Instructions!$C$26)*100","v":0},{"$f":"(Y265/Instructions!$C$27)*100","v":0},{"$f":"(AB265/Instructions!$C$28)*100","v":0},{"$f":"(AF265/Instructions!$C$29)*100","v":0},{"$f":"(AJ265/Instructions!$C$30)*100","v":0},{"$f":"(AN265/Instructions!$C$31)*100","v":0},0,{"$f":"(AS265/Instructions!$C$33)*100","v":{"$error":"#VALUE!"}},"----","E","E","E","E","E","E","E","E","E","E","--","E",null,null,null,null,{"$f":"Table_2[[#This Row],[Column51]]&Table_2[[#This Row],[Column52]]&BU267","v":""}]
[264,null,null,null,null,null,null,null,null,null,null,null,0,null,null,0,null,null,0,null,null,0,null,null,0,null,null,0,null,null,null,0,null,null,null,{"$f":"IF(AG266<Instructions!D295,AG266,SUM(AG266:AI266))","v":0},null,null,null,{"$f":"IF(AK266<Instructions!D294,AK266,SUM(AK266:AM266))","v":0},null,null,null,{"$f":"IF(AO266<Instructions!D293,AO266,SUM(AO266:AQ266))","v":0},"--",0,{"$f":"SUM(Table_2[[#This Row],[Column20]],Table_2[[#This Row],[Column19]],Table_2[[#This Row],[Column18]])","v":0},"HEALTH & PHY. EDU.",{"$f":"(M266/Instructions!$C$23)*100","v":0},{"$f":"(P266/Instructions!$C$24)*100","v":0},{"$f":"(S266/Instructions!$C$25)*100","v":0},{"$f":"(V266/Instructions!$C$26)*100","v":0},{"$f":"(Y266/Instructions!$C$27)*100","v":0},{"$f":"(AB266/Instructions!$C$28)*100","v":0},{"$f":"(AF266/Instructions!$C$29)*100","v":0},{"$f":"(AJ266/Instructions!$C$30)*100","v":0},{"$f":"(AN266/Instructions!$C$31)*100","v":0},0,{"$f":"(AS266/Instructions!$C$33)*100","v":{"$error":"#VALUE!"}},"----","E","E","E","E","E","E","E","E","E","E","--","E",null,null,null,null,{"$f":"Table_2[[#This Row],[Column51]]&Table_2[[#This Row],[Column52]]&BU268","v":""}]
[265,null,null,null,null,null,null,null,null,null,null,null,0,null,null,0,null,null,0,null,null,0,null,null,0,null,null,0,null,null,null,0,null,null,null,{"$f":"IF(AG267<Instructions!D296,AG267,SUM(AG267:AI267))","v":0},null,null,null,{"$f":"IF(AK267<Instructions!D295,AK267,SUM(AK267:AM267))","v":0},null,null,null,{"$f":"IF(AO267<Instructions!D294,AO267,SUM(AO267:AQ267))","v":0},"--",0,{"$f":"SUM(Table_2[[#This Row],[Column20]],Table_2[[#This Row],[Column19]],Table_2[[#This Row],[Column18]])","v":0},"HEALTH & PHY. EDU.",{"$f":"(M267/Instructions!$C$23)*100","v":0},{"$f":"(P267/Instructions!$C$24)*100","v":0},{"$f":"(S267/Instructions!$C$25)*100","v":0},{"$f":"(V267/Instructions!$C$26)*100","v":0},{"$f":"(Y267/Instructions!$C$27)*100","v":0},{"$f":"(AB267/Instructions!$C$28)*100","v":0},{"$f":"(AF267/Instructions!$C$29)*100","v":0},{"$f":"(AJ267/Instructions!$C$30)*100","v":0},{"$f":"(AN267/Instructions!$C$31)*100","v":0},0,{"$f":"(AS267/Instructions!$C$33)*100","v":{"$error":"#VALUE!"}},"----","E","E","E","E","E","E","E","E","E","E","--","E",null,null,null,null,{"$f":"Table_2[[#This Row],[Column51]]&Table_2[[#This Row],[Column52]]&BU269","v":""}]
[266,null,null,null,null,null,null,null,null,null,null,null,0,null,null,0,null,null,0,null,null,0,null,null,0,null,null,0,null,null,null,0,null,null,null,{"$f":"IF(AG268<Instructions!D297,AG268,SUM(AG268:AI268))","v":0},null,null,null,{"$f":"IF(AK268<Instructions!D296,AK268,SUM(AK268:AM268))","v":0},null,null,null,{"$f":"IF(AO268<Instructions!D295,AO268,SUM(AO268:AQ268))","v":0},"--",0,{"$f":"SUM(Table_2[[#This Row],[Column20]],Table_2[[#This Row],[Column19]],Table_2[[#This Row],[Column18]])","v":0},"HEALTH & PHY. EDU.",{"$f":"(M268/Instructions!$C$23)*100","v":0},{"$f":"(P268/Instructions!$C$24)*100","v":0},{"$f":"(S268/Instructions!$C$25)*100","v":0},{"$f":"(V268/Instructions!$C$26)*100","v":0},{"$f":"(Y268/Instructions!$C$27)*100","v":0},{"$f":"(AB268/Instructions!$C$28)*100","v":0},{"$f":"(AF268/Instructions!$C$29)*100","v":0},{"$f":"(AJ268/Instructions!$C$30)*100","v":0},{"$f":"(AN268/Instructions!$C$31)*100","v":0},0,{"$f":"(AS268/Instructions!$C$33)*100","v":{"$error":"#VALUE!"}},"----","E","E","E","E","E","E","E","E","E","E","--","E",null,null,null,null,{"$f":"Table_2[[#This Row],[Column51]]&Table_2[[#This Row],[Column52]]&BU270","v":""}]
[267,null,null,null,null,null,null,null,null,null,null,null,0,null,null,0,null,null,0,null,null,0,null,null,0,null,null,0,null,null,null,0,null,null,null,{"$f":"IF(AG269<Instructions!D298,AG269,SUM(AG269:AI269))","v":0},null,null,null,{"$f":"IF(AK269<Instructions!D297,AK269,SUM(AK269:AM269))","v":0},null,null,null,{"$f":"IF(AO269<Instructions!D296,AO269,SUM(AO269:AQ269))","v":0},"--",0,{"$f":"SUM(Table_2[[#This Row],[Column20]],Table_2[[#This Row],[Column19]],Table_2[[#This Row],[Column18]])","v":0},"HEALTH & PHY. EDU.",{"$f":"(M269/Instructions!$C$23)*100","v":0},{"$f":"(P269/Instructions!$C$24)*100","v":0},{"$f":"(S269/Instructions!$C$25)*100","v":0},{"$f":"(V269/Instructions!$C$26)*100","v":0},{"$f":"(Y269/Instructions!$C$27)*100","v":0},{"$f":"(AB269/Instructions!$C$28)*100","v":0},{"$f":"(AF269/Instructions!$C$29)*100","v":0},{"$f":"(AJ269/Instructions!$C$30)*100","v":0},{"$f":"(AN269/Instructions!$C$31)*100","v":0},0,{"$f":"(AS269/Instructions!$C$33)*100","v":{"$error":"#VALUE!"}},"----","E","E","E","E","E","E","E","E","E","E","--","E",null,null,null,null,{"$f":"Table_2[[#This Row],[Column51]]&Table_2[[#This Row],[Column52]]&BU271","v":""}]
[268,null,null,null,null,null,null,null,null,null,null,null,0,null,null,0,null,null,0,null,null,0,null,null,0,null,null,0,null,null,null,0,null,null,null,{"$f":"IF(AG270<Instructions!D299,AG270,SUM(AG270:AI270))","v":0},null,null,null,{"$f":"IF(AK270<Instructions!D298,AK270,SUM(AK270:AM270))","v":0},null,null,null,{"$f":"IF(AO270<Instructions!D297,AO270,SUM(AO270:AQ270))","v":0},"--",0,{"$f":"SUM(Table_2[[#This Row],[Column20]],Table_2[[#This Row],[Column19]],Table_2[[#This Row],[Column18]])","v":0},"HEALTH & PHY. EDU.",{"$f":"(M270/Instructions!$C$23)*100","v":0},{"$f":"(P270/Instructions!$C$24)*100","v":0},{"$f":"(S270/Instructions!$C$25)*100","v":0},{"$f":"(V270/Instructions!$C$26)*100","v":0},{"$f":"(Y270/Instructions!$C$27)*100","v":0},{"$f":"(AB270/Instructions!$C$28)*100","v":0},{"$f":"(AF270/Instructions!$C$29)*100","v":0},{"$f":"(AJ270/Instructions!$C$30)*100","v":0},{"$f":"(AN270/Instructions!$C$31)*100","v":0},0,{"$f":"(AS270/Instructions!$C$33)*100","v":{"$error":"#VALUE!"}},"----","E","E","E","E","E","E","E","E","E","E","--","E",null,null,null,null,{"$f":"Table_2[[#This Row],[Column51]]&Table_2[[#This Row],[Column52]]&BU272","v":""}]
[269,null,null,null,null,null,null,null,null,null,null,null,0,null,null,0,null,null,0,null,null,0,null,null,0,null,null,0,null,null,null,0,null,null,null,{"$f":"IF(AG271<Instructions!D300,AG271,SUM(AG271:AI271))","v":0},null,null,null,{"$f":"IF(AK271<Instructions!D299,AK271,SUM(AK271:AM271))","v":0},null,null,null,{"$f":"IF(AO271<Instructions!D298,AO271,SUM(AO271:AQ271))","v":0},"--",0,{"$f":"SUM(Table_2[[#This Row],[Column20]],Table_2[[#This Row],[Column19]],Table_2[[#This Row],[Column18]])","v":0},"HEALTH & PHY. EDU.",{"$f":"(M271/Instructions!$C$23)*100","v":0},{"$f":"(P271/Instructions!$C$24)*100","v":0},{"$f":"(S271/Instructions!$C$25)*100","v":0},{"$f":"(V271/Instructions!$C$26)*100","v":0},{"$f":"(Y271/Instructions!$C$27)*100","v":0},{"$f":"(AB271/Instructions!$C$28)*100","v":0},{"$f":"(AF271/Instructions!$C$29)*100","v":0},{"$f":"(AJ271/Instructions!$C$30)*100","v":0},{"$f":"(AN271/Instructions!$C$31)*100","v":0},0,{"$f":"(AS271/Instructions!$C$33)*100","v":{"$error":"#VALUE!"}},"----","E","E","E","E","E","E","E","E","E","E","--","E",null,null,null,null,{"$f":"Table_2[[#This Row],[Column51]]&Table_2[[#This Row],[Column52]]&BU273","v":""}]
[270,null,null,null,null,null,null,null,null,null,null,null,0,null,null,0,null,null,0,null,null,0,null,null,0,null,null,0,null,null,null,0,null,null,null,{"$f":"IF(AG272<Instructions!D301,AG272,SUM(AG272:AI272))","v":0},null,null,null,{"$f":"IF(AK272<Instructions!D300,AK272,SUM(AK272:AM272))","v":0},null,null,null,{"$f":"IF(AO272<Instructions!D299,AO272,SUM(AO272:AQ272))","v":0},"--",0,{"$f":"SUM(Table_2[[#This Row],[Column20]],Table_2[[#This Row],[Column19]],Table_2[[#This Row],[Column18]])","v":0},"HEALTH & PHY. EDU.",{"$f":"(M272/Instructions!$C$23)*100","v":0},{"$f":"(P272/Instructions!$C$24)*100","v":0},{"$f":"(S272/Instructions!$C$25)*100","v":0},{"$f":"(V272/Instructions!$C$26)*100","v":0},{"$f":"(Y272/Instructions!$C$27)*100","v":0},{"$f":"(AB272/Instructions!$C$28)*100","v":0},{"$f":"(AF272/Instructions!$C$29)*100","v":0},{"$f":"(AJ272/Instructions!$C$30)*100","v":0},{"$f":"(AN272/Instructions!$C$31)*100","v":0},0,{"$f":"(AS272/Instructions!$C$33)*100","v":{"$error":"#VALUE!"}},"----","E","E","E","E","E","E","E","E","E","E","--","E",null,null,null,null,{"$f":"Table_2[[#This Row],[Column51]]&Table_2[[#This Row],[Column52]]&BU274","v":""}]
[271,null,null,null,null,null,null,null,null,null,null,null,0,null,null,0,null,null,0,null,null,0,null,null,0,null,null,0,null,null,null,0,null,null,null,{"$f":"IF(AG273<Instructions!D302,AG273,SUM(AG273:AI273))","v":0},null,null,null,{"$f":"IF(AK273<Instructions!D301,AK273,SUM(AK273:AM273))","v":0},null,null,null,{"$f":"IF(AO273<Instructions!D300,AO273,SUM(AO273:AQ273))","v":0},"--",0,{"$f":"SUM(Table_2[[#This Row],[Column20]],Table_2[[#This Row],[Column19]],Table_2[[#This Row],[Column18]])","v":0},"HEALTH & PHY. EDU.",{"$f":"(M273/Instructions!$C$23)*100","v":0},{"$f":"(P273/Instructions!$C$24)*100","v":0},{"$f":"(S273/Instructions!$C$25)*100","v":0},{"$f":"(V273/Instructions!$C$26)*100","v":0},{"$f":"(Y273/Instructions!$C$27)*100","v":0},{"$f":"(AB273/Instructions!$C$28)*100","v":0},{"$f":"(AF273/Instructions!$C$29)*100","v":0},{"$f":"(AJ273/Instructions!$C$30)*100","v":0},{"$f":"(AN273/Instructions!$C$31)*100","v":0},0,{"$f":"(AS273/Instructions!$C$33)*100","v":{"$error":"#VALUE!"}},"----","E","E","E","E","E","E","E","E","E","E","--","E",null,null,null,null,{"$f":"Table_2[[#This Row],[Column51]]&Table_2[[#This Row],[Column52]]&BU275","v":""}]
[272,null,null,null,null,null,null,null,null,null,null,null,0,null,null,0,null,null,0,null,null,0,null,null,0,null,null,0,null,null,null,0,null,null,null,{"$f":"IF(AG274<Instructions!D303,AG274,SUM(AG274:AI274))","v":0},null,null,null,{"$f":"IF(AK274<Instructions!D302,AK274,SUM(AK274:AM274))","v":0},null,null,null,{"$f":"IF(AO274<Instructions!D301,AO274,SUM(AO274:AQ274))","v":0},"--",0,{"$f":"SUM(Table_2[[#This Row],[Column20]],Table_2[[#This Row],[Column19]],Table_2[[#This Row],[Column18]])","v":0},"HEALTH & PHY. EDU.",{"$f":"(M274/Instructions!$C$23)*100","v":0},{"$f":"(P274/Instructions!$C$24)*100","v":0},{"$f":"(S274/Instructions!$C$25)*100","v":0},{"$f":"(V274/Instructions!$C$26)*100","v":0},{"$f":"(Y274/Instructions!$C$27)*100","v":0},{"$f":"(AB274/Instructions!$C$28)*100","v":0},{"$f":"(AF274/Instructions!$C$29)*100","v":0},{"$f":"(AJ274/Instructions!$C$30)*100","v":0},{"$f":"(AN274/Instructions!$C$31)*100","v":0},0,{"$f":"(AS274/Instructions!$C$33)*100","v":{"$error":"#VALUE!"}},"----","E","E","E","E","E","E","E","E","E","E","--","E",null,null,null,null,{"$f":"Table_2[[#This Row],[Column51]]&Table_2[[#This Row],[Column52]]&BU276","v":""}]
[273,null,null,null,null,null,null,null,null,null,null,null,0,null,null,0,null,null,0,null,null,0,null,null,0,null,null,0,null,null,null,0,null,null,null,{"$f":"IF(AG275<Instructions!D304,AG275,SUM(AG275:AI275))","v":0},null,null,null,{"$f":"IF(AK275<Instructions!D303,AK275,SUM(AK275:AM275))","v":0},null,null,null,{"$f":"IF(AO275<Instructions!D302,AO275,SUM(AO275:AQ275))","v":0},"--",0,{"$f":"SUM(Table_2[[#This Row],[Column20]],Table_2[[#This Row],[Column19]],Table_2[[#This Row],[Column18]])","v":0},"HEALTH & PHY. EDU.",{"$f":"(M275/Instructions!$C$23)*100","v":0},{"$f":"(P275/Instructions!$C$24)*100","v":0},{"$f":"(S275/Instructions!$C$25)*100","v":0},{"$f":"(V275/Instructions!$C$26)*100","v":0},{"$f":"(Y275/Instructions!$C$27)*100","v":0},{"$f":"(AB275/Instructions!$C$28)*100","v":0},{"$f":"(AF275/Instructions!$C$29)*100","v":0},{"$f":"(AJ275/Instructions!$C$30)*100","v":0},{"$f":"(AN275/Instructions!$C$31)*100","v":0},0,{"$f":"(AS275/Instructions!$C$33)*100","v":{"$error":"#VALUE!"}},"----",{"$f":"IFERROR(IF(AW275>90,\"A+\",IF(AW275>80,\"A\",IF(AW275>70,\"B+\",IF(AW275>60,\"B\",IF(AW275>50,\"C+\",IF(AW275>40,\"C\",IF(AW275>=33,\"D\",\"E\"))))))),\"Abs\")","v":"E"},"E","E","E","E","E","E","E","E","E","--","E",null,null,null,null,{"$f":"Table_2[[#This Row],[Column51]]&Table_2[[#This Row],[Column52]]&BU277","v":""}]
[274,null,null,null,null,null,null,null,null,null,null,null,0,null,null,0,null,null,0,null,null,0,null,null,0,null,null,0,null,null,null,0,null,null,null,{"$f":"IF(AG276<Instructions!D305,AG276,SUM(AG276:AI276))","v":0},null,null,null,{"$f":"IF(AK276<Instructions!D304,AK276,SUM(AK276:AM276))","v":0},null,null,null,{"$f":"IF(AO276<Instructions!D303,AO276,SUM(AO276:AQ276))","v":0},"--",0,{"$f":"SUM(Table_2[[#This Row],[Column20]],Table_2[[#This Row],[Column19]],Table_2[[#This Row],[Column18]])","v":0},"HEALTH & PHY. EDU.",{"$f":"(M276/Instructions!$C$23)*100","v":0},{"$f":"(P276/Instructions!$C$24)*100","v":0},{"$f":"(S276/Instructions!$C$25)*100","v":0},{"$f":"(V276/Instructions!$C$26)*100","v":0},{"$f":"(Y276/Instructions!$C$27)*100","v":0},{"$f":"(AB276/Instructions!$C$28)*100","v":0},{"$f":"(AF276/Instructions!$C$29)*100","v":0},{"$f":"(AJ276/Instructions!$C$30)*100","v":0},{"$f":"(AN276/Instructions!$C$31)*100","v":0},0,{"$f":"(AS276/Instructions!$C$33)*100","v":{"$error":"#VALUE!"}},"----","E","E","E","E","E","E","E","E","E","E","--","E",null,null,null,null,{"$f":"Table_2[[#This Row],[Column51]]&Table_2[[#This Row],[Column52]]&BU278","v":""}]
[275,null,null,null,null,null,null,null,null,null,null,null,0,null,null,0,null,null,0,null,null,0,null,null,0,null,null,0,null,null,null,0,null,null,null,{"$f":"IF(AG277<Instructions!D306,AG277,SUM(AG277:AI277))","v":0},null,null,null,{"$f":"IF(AK277<Instructions!D305,AK277,SUM(AK277:AM277))","v":0},null,null,null,{"$f":"IF(AO277<Instructions!D304,AO277,SUM(AO277:AQ277))","v":0},"--",0,{"$f":"SUM(Table_2[[#This Row],[Column20]],Table_2[[#This Row],[Column19]],Table_2[[#This Row],[Column18]])","v":0},"HEALTH & PHY. EDU.",{"$f":"(M277/Instructions!$C$23)*100","v":0},{"$f":"(P277/Instructions!$C$24)*100","v":0},{"$f":"(S277/Instructions!$C$25)*100","v":0},{"$f":"(V277/Instructions!$C$26)*100","v":0},{"$f":"(Y277/Instructions!$C$27)*100","v":0},{"$f":"(AB277/Instructions!$C$28)*100","v":0},{"$f":"(AF277/Instructions!$C$29)*100","v":0},{"$f":"(AJ277/Instructions!$C$30)*100","v":0},{"$f":"(AN277/Instructions!$C$31)*100","v":0},0,{"$f":"(AS277/Instructions!$C$33)*100","v":{"$error":"#VALUE!"}},"----","E","E","E","E","E","E","E","E","E","E","--","E",null,null,null,null,{"$f":"Table_2[[#This Row],[Column51]]&Table_2[[#This Row],[Column52]]&BU279","v":""}]
[276,null,null,null,null,null,null,null,null,null,null,null,0,null,null,0,null,null,0,null,null,0,null,null,0,null,null,0,null,null,null,0,null,null,null,{"$f":"IF(AG278<Instructions!D307,AG278,SUM(AG278:AI278))","v":0},null,null,null,{"$f":"IF(AK278<Instructions!D306,AK278,SUM(AK278:AM278))","v":0},null,null,null,{"$f":"IF(AO278<Instructions!D305,AO278,SUM(AO278:AQ278))","v":0},"--",0,{"$f":"SUM(Table_2[[#This Row],[Column20]],Table_2[[#This Row],[Column19]],Table_2[[#This Row],[Column18]])","v":0},"HEALTH & PHY. EDU.",{"$f":"(M278/Instructions!$C$23)*100","v":0},{"$f":"(P278/Instructions!$C$24)*100","v":0},{"$f":"(S278/Instructions!$C$25)*100","v":0},{"$f":"(V278/Instructions!$C$26)*100","v":0},{"$f":"(Y278/Instructions!$C$27)*100","v":0},{"$f":"(AB278/Instructions!$C$28)*100","v":0},{"$f":"(AF278/Instructions!$C$29)*100","v":0},{"$f":"(AJ278/Instructions!$C$30)*100","v":0},{"$f":"(AN278/Instructions!$C$31)*100","v":0},0,{"$f":"(AS278/Instructions!$C$33)*100","v":{"$error":"#VALUE!"}},"----","E","E","E","E","E","E","E","E","E","E","--","E",null,null,null,null,{"$f":"Table_2[[#This Row],[Column51]]&Table_2[[#This Row],[Column52]]&BU280","v":""}]
[277,null,null,null,null,null,null,null,null,null,null,null,0,null,null,0,null,null,0,null,null,0,null,null,0,null,null,0,null,null,null,0,null,null,null,{"$f":"IF(AG279<Instructions!D308,AG279,SUM(AG279:AI279))","v":0},null,null,null,{"$f":"IF(AK279<Instructions!D307,AK279,SUM(AK279:AM279))","v":0},null,null,null,{"$f":"IF(AO279<Instructions!D306,AO279,SUM(AO279:AQ279))","v":0},"--",0,{"$f":"SUM(Table_2[[#This Row],[Column20]],Table_2[[#This Row],[Column19]],Table_2[[#This Row],[Column18]])","v":0},"HEALTH & PHY. EDU.",{"$f":"(M279/Instructions!$C$23)*100","v":0},{"$f":"(P279/Instructions!$C$24)*100","v":0},{"$f":"(S279/Instructions!$C$25)*100","v":0},{"$f":"(V279/Instructions!$C$26)*100","v":0},{"$f":"(Y279/Instructions!$C$27)*100","v":0},{"$f":"(AB279/Instructions!$C$28)*100","v":0},{"$f":"(AF279/Instructions!$C$29)*100","v":0},{"$f":"(AJ279/Instructions!$C$30)*100","v":0},{"$f":"(AN279/Instructions!$C$31)*100","v":0},0,{"$f":"(AS279/Instructions!$C$33)*100","v":{"$error":"#VALUE!"}},"----","E","E","E","E","E","E","E","E","E","E","--","E",null,null,null,null,{"$f":"Table_2[[#This Row],[Column51]]&Table_2[[#This Row],[Column52]]&BU281","v":""}]
[278,null,null,null,null,null,null,null,null,null,null,null,0,null,null,0,null,null,0,null,null,0,null,null,0,null,null,0,null,null,null,0,null,null,null,{"$f":"IF(AG280<Instructions!D309,AG280,SUM(AG280:AI280))","v":0},null,null,null,{"$f":"IF(AK280<Instructions!D308,AK280,SUM(AK280:AM280))","v":0},null,null,null,{"$f":"IF(AO280<Instructions!D307,AO280,SUM(AO280:AQ280))","v":0},"--",0,{"$f":"SUM(Table_2[[#This Row],[Column20]],Table_2[[#This Row],[Column19]],Table_2[[#This Row],[Column18]])","v":0},"HEALTH & PHY. EDU.",{"$f":"(M280/Instructions!$C$23)*100","v":0},{"$f":"(P280/Instructions!$C$24)*100","v":0},{"$f":"(S280/Instructions!$C$25)*100","v":0},{"$f":"(V280/Instructions!$C$26)*100","v":0},{"$f":"(Y280/Instructions!$C$27)*100","v":0},{"$f":"(AB280/Instructions!$C$28)*100","v":0},{"$f":"(AF280/Instructions!$C$29)*100","v":0},{"$f":"(AJ280/Instructions!$C$30)*100","v":0},{"$f":"(AN280/Instructions!$C$31)*100","v":0},0,{"$f":"(AS280/Instructions!$C$33)*100","v":{"$error":"#VALUE!"}},"----","E","E","E","E","E","E","E","E","E","E","--","E",null,null,null,null,{"$f":"Table_2[[#This Row],[Column51]]&Table_2[[#This Row],[Column52]]&BU282","v":""}]
[279,null,null,null,null,null,null,null,null,null,null,null,0,null,null,0,null,null,0,null,null,0,null,null,0,null,null,0,null,null,null,0,null,null,null,{"$f":"IF(AG281<Instructions!D310,AG281,SUM(AG281:AI281))","v":0},null,null,null,{"$f":"IF(AK281<Instructions!D309,AK281,SUM(AK281:AM281))","v":0},null,null,null,{"$f":"IF(AO281<Instructions!D308,AO281,SUM(AO281:AQ281))","v":0},"--",0,{"$f":"SUM(Table_2[[#This Row],[Column20]],Table_2[[#This Row],[Column19]],Table_2[[#This Row],[Column18]])","v":0},"HEALTH & PHY. EDU.",{"$f":"(M281/Instructions!$C$23)*100","v":0},{"$f":"(P281/Instructions!$C$24)*100","v":0},{"$f":"(S281/Instructions!$C$25)*100","v":0},{"$f":"(V281/Instructions!$C$26)*100","v":0},{"$f":"(Y281/Instructions!$C$27)*100","v":0},{"$f":"(AB281/Instructions!$C$28)*100","v":0},{"$f":"(AF281/Instructions!$C$29)*100","v":0},{"$f":"(AJ281/Instructions!$C$30)*100","v":0},{"$f":"(AN281/Instructions!$C$31)*100","v":0},0,{"$f":"(AS281/Instructions!$C$33)*100","v":{"$error":"#VALUE!"}},"----","E","E","E","E","E","E","E","E","E","E","--","E",null,null,null,null,{"$f":"Table_2[[#This Row],[Column51]]&Table_2[[#This Row],[Column52]]&BU283","v":""}]
[280,null,null,null,null,null,null,null,null,null,null,null,0,null,null,0,null,null,0,null,null,0,null,null,0,null,null,0,null,null,null,0,null,null,null,{"$f":"IF(AG282<Instructions!D311,AG282,SUM(AG282:AI282))","v":0},null,null,null,{"$f":"IF(AK282<Instructions!D310,AK282,SUM(AK282:AM282))","v":0},null,null,null,{"$f":"IF(AO282<Instructions!D309,AO282,SUM(AO282:AQ282))","v":0},"--",0,{"$f":"SUM(Table_2[[#This Row],[Column20]],Table_2[[#This Row],[Column19]],Table_2[[#This Row],[Column18]])","v":0},"HEALTH & PHY. EDU.",{"$f":"(M282/Instructions!$C$23)*100","v":0},{"$f":"(P282/Instructions!$C$24)*100","v":0},{"$f":"(S282/Instructions!$C$25)*100","v":0},{"$f":"(V282/Instructions!$C$26)*100","v":0},{"$f":"(Y282/Instructions!$C$27)*100","v":0},{"$f":"(AB282/Instructions!$C$28)*100","v":0},{"$f":"(AF282/Instructions!$C$29)*100","v":0},{"$f":"(AJ282/Instructions!$C$30)*100","v":0},{"$f":"(AN282/Instructions!$C$31)*100","v":0},0,{"$f":"(AS282/Instructions!$C$33)*100","v":{"$error":"#VALUE!"}},"----","E","E","E","E","E","E","E","E","E","E","--","E",null,null,null,null,{"$f":"Table_2[[#This Row],[Column51]]&Table_2[[#This Row],[Column52]]&BU284","v":""}]
[281,null,null,null,null,null,null,null,null,null,null,null,0,null,null,0,null,null,0,null,null,0,null,null,0,null,null,0,null,null,null,0,null,null,null,{"$f":"IF(AG283<Instructions!D312,AG283,SUM(AG283:AI283))","v":0},null,null,null,{"$f":"IF(AK283<Instructions!D311,AK283,SUM(AK283:AM283))","v":0},null,null,null,{"$f":"IF(AO283<Instructions!D310,AO283,SUM(AO283:AQ283))","v":0},"--",0,{"$f":"SUM(Table_2[[#This Row],[Column20]],Table_2[[#This Row],[Column19]],Table_2[[#This Row],[Column18]])","v":0},"HEALTH & PHY. EDU.",{"$f":"(M283/Instructions!$C$23)*100","v":0},{"$f":"(P283/Instructions!$C$24)*100","v":0},{"$f":"(S283/Instructions!$C$25)*100","v":0},{"$f":"(V283/Instructions!$C$26)*100","v":0},{"$f":"(Y283/Instructions!$C$27)*100","v":0},{"$f":"(AB283/Instructions!$C$28)*100","v":0},{"$f":"(AF283/Instructions!$C$29)*100","v":0},{"$f":"(AJ283/Instructions!$C$30)*100","v":0},{"$f":"(AN283/Instructions!$C$31)*100","v":0},0,{"$f":"(AS283/Instructions!$C$33)*100","v":{"$error":"#VALUE!"}},"----","E","E","E","E","E","E","E","E","E","E","--","E",null,null,null,null,{"$f":"Table_2[[#This Row],[Column51]]&Table_2[[#This Row],[Column52]]&BU285","v":""}]
[282,null,null,null,null,null,null,null,null,null,null,null,0,null,null,0,null,null,0,null,null,0,null,null,0,null,null,0,null,null,null,0,null,null,null,{"$f":"IF(AG284<Instructions!D313,AG284,SUM(AG284:AI284))","v":0},null,null,null,{"$f":"IF(AK284<Instructions!D312,AK284,SUM(AK284:AM284))","v":0},null,null,null,{"$f":"IF(AO284<Instructions!D311,AO284,SUM(AO284:AQ284))","v":0},"--",0,{"$f":"SUM(Table_2[[#This Row],[Column20]],Table_2[[#This Row],[Column19]],Table_2[[#This Row],[Column18]])","v":0},"HEALTH & PHY. EDU.",{"$f":"(M284/Instructions!$C$23)*100","v":0},{"$f":"(P284/Instructions!$C$24)*100","v":0},{"$f":"(S284/Instructions!$C$25)*100","v":0},{"$f":"(V284/Instructions!$C$26)*100","v":0},{"$f":"(Y284/Instructions!$C$27)*100","v":0},{"$f":"(AB284/Instructions!$C$28)*100","v":0},{"$f":"(AF284/Instructions!$C$29)*100","v":0},{"$f":"(AJ284/Instructions!$C$30)*100","v":0},{"$f":"(AN284/Instructions!$C$31)*100","v":0},0,{"$f":"(AS284/Instructions!$C$33)*100","v":{"$error":"#VALUE!"}},"----","E","E","E","E","E","E","E","E","E","E","--","E",null,null,null,null,{"$f":"Table_2[[#This Row],[Column51]]&Table_2[[#This Row],[Column52]]&BU286","v":""}]
[283,null,null,null,null,null,null,null,null,null,null,null,0,null,null,0,null,null,0,null,null,0,null,null,0,null,null,0,null,null,null,0,null,null,null,{"$f":"IF(AG285<Instructions!D314,AG285,SUM(AG285:AI285))","v":0},null,null,null,{"$f":"IF(AK285<Instructions!D313,AK285,SUM(AK285:AM285))","v":0},null,null,null,{"$f":"IF(AO285<Instructions!D312,AO285,SUM(AO285:AQ285))","v":0},"--",0,{"$f":"SUM(Table_2[[#This Row],[Column20]],Table_2[[#This Row],[Column19]],Table_2[[#This Row],[Column18]])","v":0},"HEALTH & PHY. EDU.",{"$f":"(M285/Instructions!$C$23)*100","v":0},{"$f":"(P285/Instructions!$C$24)*100","v":0},{"$f":"(S285/Instructions!$C$25)*100","v":0},{"$f":"(V285/Instructions!$C$26)*100","v":0},{"$f":"(Y285/Instructions!$C$27)*100","v":0},{"$f":"(AB285/Instructions!$C$28)*100","v":0},{"$f":"(AF285/Instructions!$C$29)*100","v":0},{"$f":"(AJ285/Instructions!$C$30)*100","v":0},{"$f":"(AN285/Instructions!$C$31)*100","v":0},0,{"$f":"(AS285/Instructions!$C$33)*100","v":{"$error":"#VALUE!"}},"----","E","E","E","E","E","E","E","E","E","E","--","E",null,null,null,null,{"$f":"Table_2[[#This Row],[Column51]]&Table_2[[#This Row],[Column52]]&BU287","v":""}]
[284,null,null,null,null,null,null,null,null,null,null,null,0,null,null,0,null,null,0,null,null,0,null,null,0,null,null,0,null,null,null,0,null,null,null,{"$f":"IF(AG286<Instructions!D315,AG286,SUM(AG286:AI286))","v":0},null,null,null,{"$f":"IF(AK286<Instructions!D314,AK286,SUM(AK286:AM286))","v":0},null,null,null,{"$f":"IF(AO286<Instructions!D313,AO286,SUM(AO286:AQ286))","v":0},"--",0,{"$f":"SUM(Table_2[[#This Row],[Column20]],Table_2[[#This Row],[Column19]],Table_2[[#This Row],[Column18]])","v":0},"HEALTH & PHY. EDU.",{"$f":"(M286/Instructions!$C$23)*100","v":0},{"$f":"(P286/Instructions!$C$24)*100","v":0},{"$f":"(S286/Instructions!$C$25)*100","v":0},{"$f":"(V286/Instructions!$C$26)*100","v":0},{"$f":"(Y286/Instructions!$C$27)*100","v":0},{"$f":"(AB286/Instructions!$C$28)*100","v":0},{"$f":"(AF286/Instructions!$C$29)*100","v":0},{"$f":"(AJ286/Instructions!$C$30)*100","v":0},{"$f":"(AN286/Instructions!$C$31)*100","v":0},0,{"$f":"(AS286/Instructions!$C$33)*100","v":{"$error":"#VALUE!"}},"----","E","E","E","E","E","E","E","E","E","E","--","E",null,null,null,null,{"$f":"Table_2[[#This Row],[Column51]]&Table_2[[#This Row],[Column52]]&BU288","v":""}]
[285,null,null,null,null,null,null,null,null,null,null,null,0,null,null,0,null,null,0,null,null,0,null,null,0,null,null,0,null,null,null,0,null,null,null,{"$f":"IF(AG287<Instructions!D316,AG287,SUM(AG287:AI287))","v":0},null,null,null,{"$f":"IF(AK287<Instructions!D315,AK287,SUM(AK287:AM287))","v":0},null,null,null,{"$f":"IF(AO287<Instructions!D314,AO287,SUM(AO287:AQ287))","v":0},"--",0,{"$f":"SUM(Table_2[[#This Row],[Column20]],Table_2[[#This Row],[Column19]],Table_2[[#This Row],[Column18]])","v":0},"HEALTH & PHY. EDU.",{"$f":"(M287/Instructions!$C$23)*100","v":0},{"$f":"(P287/Instructions!$C$24)*100","v":0},{"$f":"(S287/Instructions!$C$25)*100","v":0},{"$f":"(V287/Instructions!$C$26)*100","v":0},{"$f":"(Y287/Instructions!$C$27)*100","v":0},{"$f":"(AB287/Instructions!$C$28)*100","v":0},{"$f":"(AF287/Instructions!$C$29)*100","v":0},{"$f":"(AJ287/Instructions!$C$30)*100","v":0},{"$f":"(AN287/Instructions!$C$31)*100","v":0},0,{"$f":"(AS287/Instructions!$C$33)*100","v":{"$error":"#VALUE!"}},"----","E","E","E","E","E","E","E","E","E","E","--","E",null,null,null,null,{"$f":"Table_2[[#This Row],[Column51]]&Table_2[[#This Row],[Column52]]&BU289","v":""}]
[286,null,null,null,null,null,null,null,null,null,null,null,0,null,null,0,null,null,0,null,null,0,null,null,0,null,null,0,null,null,null,0,null,null,null,{"$f":"IF(AG288<Instructions!D317,AG288,SUM(AG288:AI288))","v":0},null,null,null,{"$f":"IF(AK288<Instructions!D316,AK288,SUM(AK288:AM288))","v":0},null,null,null,{"$f":"IF(AO288<Instructions!D315,AO288,SUM(AO288:AQ288))","v":0},"--",0,{"$f":"SUM(Table_2[[#This Row],[Column20]],Table_2[[#This Row],[Column19]],Table_2[[#This Row],[Column18]])","v":0},"HEALTH & PHY. EDU.",{"$f":"(M288/Instructions!$C$23)*100","v":0},{"$f":"(P288/Instructions!$C$24)*100","v":0},{"$f":"(S288/Instructions!$C$25)*100","v":0},{"$f":"(V288/Instructions!$C$26)*100","v":0},{"$f":"(Y288/Instructions!$C$27)*100","v":0},{"$f":"(AB288/Instructions!$C$28)*100","v":0},{"$f":"(AF288/Instructions!$C$29)*100","v":0},{"$f":"(AJ288/Instructions!$C$30)*100","v":0},{"$f":"(AN288/Instructions!$C$31)*100","v":0},0,{"$f":"(AS288/Instructions!$C$33)*100","v":{"$error":"#VALUE!"}},"----","E","E","E","E","E","E","E","E","E","E","--","E",null,null,null,null,{"$f":"Table_2[[#This Row],[Column51]]&Table_2[[#This Row],[Column52]]&BU290","v":""}]
[287,null,null,null,null,null,null,null,null,null,null,null,0,null,null,0,null,null,0,null,null,0,null,null,0,null,null,0,null,null,null,0,null,null,null,{"$f":"IF(AG289<Instructions!D318,AG289,SUM(AG289:AI289))","v":0},null,null,null,{"$f":"IF(AK289<Instructions!D317,AK289,SUM(AK289:AM289))","v":0},null,null,null,{"$f":"IF(AO289<Instructions!D316,AO289,SUM(AO289:AQ289))","v":0},"--",0,{"$f":"SUM(Table_2[[#This Row],[Column20]],Table_2[[#This Row],[Column19]],Table_2[[#This Row],[Column18]])","v":0},"HEALTH & PHY. EDU.",{"$f":"(M289/Instructions!$C$23)*100","v":0},{"$f":"(P289/Instructions!$C$24)*100","v":0},{"$f":"(S289/Instructions!$C$25)*100","v":0},{"$f":"(V289/Instructions!$C$26)*100","v":0},{"$f":"(Y289/Instructions!$C$27)*100","v":0},{"$f":"(AB289/Instructions!$C$28)*100","v":0},{"$f":"(AF289/Instructions!$C$29)*100","v":0},{"$f":"(AJ289/Instructions!$C$30)*100","v":0},{"$f":"(AN289/Instructions!$C$31)*100","v":0},0,{"$f":"(AS289/Instructions!$C$33)*100","v":{"$error":"#VALUE!"}},"----","E","E","E","E","E","E","E","E","E","E","--","E",null,null,null,null,{"$f":"Table_2[[#This Row],[Column51]]&Table_2[[#This Row],[Column52]]&BU291","v":""}]
[288,null,null,null,null,null,null,null,null,null,null,null,0,null,null,0,null,null,0,null,null,0,null,null,0,null,null,0,null,null,null,0,null,null,null,{"$f":"IF(AG290<Instructions!D319,AG290,SUM(AG290:AI290))","v":0},null,null,null,{"$f":"IF(AK290<Instructions!D318,AK290,SUM(AK290:AM290))","v":0},null,null,null,{"$f":"IF(AO290<Instructions!D317,AO290,SUM(AO290:AQ290))","v":0},"--",0,{"$f":"SUM(Table_2[[#This Row],[Column20]],Table_2[[#This Row],[Column19]],Table_2[[#This Row],[Column18]])","v":0},"HEALTH & PHY. EDU.",{"$f":"(M290/Instructions!$C$23)*100","v":0},{"$f":"(P290/Instructions!$C$24)*100","v":0},{"$f":"(S290/Instructions!$C$25)*100","v":0},{"$f":"(V290/Instructions!$C$26)*100","v":0},{"$f":"(Y290/Instructions!$C$27)*100","v":0},{"$f":"(AB290/Instructions!$C$28)*100","v":0},{"$f":"(AF290/Instructions!$C$29)*100","v":0},{"$f":"(AJ290/Instructions!$C$30)*100","v":0},{"$f":"(AN290/Instructions!$C$31)*100","v":0},0,{"$f":"(AS290/Instructions!$C$33)*100","v":{"$error":"#VALUE!"}},"----","E","E","E","E","E","E","E","E","E","E","--","E",null,null,null,null,{"$f":"Table_2[[#This Row],[Column51]]&Table_2[[#This Row],[Column52]]&BU292","v":""}]
[289,null,null,null,null,null,null,null,null,null,null,null,0,null,null,0,null,null,0,null,null,0,null,null,0,null,null,0,null,null,null,0,null,null,null,{"$f":"IF(AG291<Instructions!D320,AG291,SUM(AG291:AI291))","v":0},null,null,null,{"$f":"IF(AK291<Instructions!D319,AK291,SUM(AK291:AM291))","v":0},null,null,null,{"$f":"IF(AO291<Instructions!D318,AO291,SUM(AO291:AQ291))","v":0},"--",0,{"$f":"SUM(Table_2[[#This Row],[Column20]],Table_2[[#This Row],[Column19]],Table_2[[#This Row],[Column18]])","v":0},"HEALTH & PHY. EDU.",{"$f":"(M291/Instructions!$C$23)*100","v":0},{"$f":"(P291/Instructions!$C$24)*100","v":0},{"$f":"(S291/Instructions!$C$25)*100","v":0},{"$f":"(V291/Instructions!$C$26)*100","v":0},{"$f":"(Y291/Instructions!$C$27)*100","v":0},{"$f":"(AB291/Instructions!$C$28)*100","v":0},{"$f":"(AF291/Instructions!$C$29)*100","v":0},{"$f":"(AJ291/Instructions!$C$30)*100","v":0},{"$f":"(AN291/Instructions!$C$31)*100","v":0},0,{"$f":"(AS291/Instructions!$C$33)*100","v":{"$error":"#VALUE!"}},"----","E","E","E","E","E","E","E","E","E","E","--","E",null,null,null,null,{"$f":"Table_2[[#This Row],[Column51]]&Table_2[[#This Row],[Column52]]&BU293","v":""}]
[290,null,null,null,null,null,null,null,null,null,null,null,0,null,null,0,null,null,0,null,null,0,null,null,0,null,null,0,null,null,null,0,null,null,null,{"$f":"IF(AG292<Instructions!D321,AG292,SUM(AG292:AI292))","v":0},null,null,null,{"$f":"IF(AK292<Instructions!D320,AK292,SUM(AK292:AM292))","v":0},null,null,null,{"$f":"IF(AO292<Instructions!D319,AO292,SUM(AO292:AQ292))","v":0},"--",0,{"$f":"SUM(Table_2[[#This Row],[Column20]],Table_2[[#This Row],[Column19]],Table_2[[#This Row],[Column18]])","v":0},"HEALTH & PHY. EDU.",{"$f":"(M292/Instructions!$C$23)*100","v":0},{"$f":"(P292/Instructions!$C$24)*100","v":0},{"$f":"(S292/Instructions!$C$25)*100","v":0},{"$f":"(V292/Instructions!$C$26)*100","v":0},{"$f":"(Y292/Instructions!$C$27)*100","v":0},{"$f":"(AB292/Instructions!$C$28)*100","v":0},{"$f":"(AF292/Instructions!$C$29)*100","v":0},{"$f":"(AJ292/Instructions!$C$30)*100","v":0},{"$f":"(AN292/Instructions!$C$31)*100","v":0},0,{"$f":"(AS292/Instructions!$C$33)*100","v":{"$error":"#VALUE!"}},"----","E","E","E","E","E","E","E","E","E","E","--","E",null,null,null,null,{"$f":"Table_2[[#This Row],[Column51]]&Table_2[[#This Row],[Column52]]&BU294","v":""}]
[291,null,null,null,null,null,null,null,null,null,null,null,0,null,null,0,null,null,0,null,null,0,null,null,0,null,null,0,null,null,null,0,null,null,null,{"$f":"IF(AG293<Instructions!D322,AG293,SUM(AG293:AI293))","v":0},null,null,null,{"$f":"IF(AK293<Instructions!D321,AK293,SUM(AK293:AM293))","v":0},null,null,null,{"$f":"IF(AO293<Instructions!D320,AO293,SUM(AO293:AQ293))","v":0},"--",0,{"$f":"SUM(Table_2[[#This Row],[Column20]],Table_2[[#This Row],[Column19]],Table_2[[#This Row],[Column18]])","v":0},"HEALTH & PHY. EDU.",{"$f":"(M293/Instructions!$C$23)*100","v":0},{"$f":"(P293/Instructions!$C$24)*100","v":0},{"$f":"(S293/Instructions!$C$25)*100","v":0},{"$f":"(V293/Instructions!$C$26)*100","v":0},{"$f":"(Y293/Instructions!$C$27)*100","v":0},{"$f":"(AB293/Instructions!$C$28)*100","v":0},{"$f":"(AF293/Instructions!$C$29)*100","v":0},{"$f":"(AJ293/Instructions!$C$30)*100","v":0},{"$f":"(AN293/Instructions!$C$31)*100","v":0},0,{"$f":"(AS293/Instructions!$C$33)*100","v":{"$error":"#VALUE!"}},"----","E","E","E","E","E","E","E","E","E","E","--","E",null,null,null,null,{"$f":"Table_2[[#This Row],[Column51]]&Table_2[[#This Row],[Column52]]&BU295","v":""}]
[292,null,null,null,null,null,null,null,null,null,null,null,0,null,null,0,null,null,0,null,null,0,null,null,0,null,null,0,null,null,null,0,null,null,null,{"$f":"IF(AG294<Instructions!D323,AG294,SUM(AG294:AI294))","v":0},null,null,null,{"$f":"IF(AK294<Instructions!D322,AK294,SUM(AK294:AM294))","v":0},null,null,null,{"$f":"IF(AO294<Instructions!D321,AO294,SUM(AO294:AQ294))","v":0},"--",0,{"$f":"SUM(Table_2[[#This Row],[Column20]],Table_2[[#This Row],[Column19]],Table_2[[#This Row],[Column18]])","v":0},"HEALTH & PHY. EDU.",{"$f":"(M294/Instructions!$C$23)*100","v":0},{"$f":"(P294/Instructions!$C$24)*100","v":0},{"$f":"(S294/Instructions!$C$25)*100","v":0},{"$f":"(V294/Instructions!$C$26)*100","v":0},{"$f":"(Y294/Instructions!$C$27)*100","v":0},{"$f":"(AB294/Instructions!$C$28)*100","v":0},{"$f":"(AF294/Instructions!$C$29)*100","v":0},{"$f":"(AJ294/Instructions!$C$30)*100","v":0},{"$f":"(AN294/Instructions!$C$31)*100","v":0},0,{"$f":"(AS294/Instructions!$C$33)*100","v":{"$error":"#VALUE!"}},"----","E","E","E","E","E","E","E","E","E","E","--","E",null,null,null,null,{"$f":"Table_2[[#This Row],[Column51]]&Table_2[[#This Row],[Column52]]&BU296","v":""}]
[293,null,null,null,null,null,null,null,null,null,null,null,0,null,null,0,null,null,0,null,null,0,null,null,0,null,null,0,null,null,null,0,null,null,null,{"$f":"IF(AG295<Instructions!D324,AG295,SUM(AG295:AI295))","v":0},null,null,null,{"$f":"IF(AK295<Instructions!D323,AK295,SUM(AK295:AM295))","v":0},null,null,null,{"$f":"IF(AO295<Instructions!D322,AO295,SUM(AO295:AQ295))","v":0},"--",0,{"$f":"SUM(Table_2[[#This Row],[Column20]],Table_2[[#This Row],[Column19]],Table_2[[#This Row],[Column18]])","v":0},"HEALTH & PHY. EDU.",{"$f":"(M295/Instructions!$C$23)*100","v":0},{"$f":"(P295/Instructions!$C$24)*100","v":0},{"$f":"(S295/Instructions!$C$25)*100","v":0},{"$f":"(V295/Instructions!$C$26)*100","v":0},{"$f":"(Y295/Instructions!$C$27)*100","v":0},{"$f":"(AB295/Instructions!$C$28)*100","v":0},{"$f":"(AF295/Instructions!$C$29)*100","v":0},{"$f":"(AJ295/Instructions!$C$30)*100","v":0},{"$f":"(AN295/Instructions!$C$31)*100","v":0},0,{"$f":"(AS295/Instructions!$C$33)*100","v":{"$error":"#VALUE!"}},"----","E","E","E","E","E","E","E","E","E","E","--","E",null,null,null,null,{"$f":"Table_2[[#This Row],[Column51]]&Table_2[[#This Row],[Column52]]&BU297","v":""}]
[294,null,null,null,null,null,null,null,null,null,null,null,0,null,null,0,null,null,0,null,null,0,null,null,0,null,null,0,null,null,null,0,null,null,null,{"$f":"IF(AG296<Instructions!D325,AG296,SUM(AG296:AI296))","v":0},null,null,null,{"$f":"IF(AK296<Instructions!D324,AK296,SUM(AK296:AM296))","v":0},null,null,null,{"$f":"IF(AO296<Instructions!D323,AO296,SUM(AO296:AQ296))","v":0},"--",0,{"$f":"SUM(Table_2[[#This Row],[Column20]],Table_2[[#This Row],[Column19]],Table_2[[#This Row],[Column18]])","v":0},"HEALTH & PHY. EDU.",{"$f":"(M296/Instructions!$C$23)*100","v":0},{"$f":"(P296/Instructions!$C$24)*100","v":0},{"$f":"(S296/Instructions!$C$25)*100","v":0},{"$f":"(V296/Instructions!$C$26)*100","v":0},{"$f":"(Y296/Instructions!$C$27)*100","v":0},{"$f":"(AB296/Instructions!$C$28)*100","v":0},{"$f":"(AF296/Instructions!$C$29)*100","v":0},{"$f":"(AJ296/Instructions!$C$30)*100","v":0},{"$f":"(AN296/Instructions!$C$31)*100","v":0},0,{"$f":"(AS296/Instructions!$C$33)*100","v":{"$error":"#VALUE!"}},"----","E","E","E","E","E","E","E","E","E","E","--","E",null,null,null,null,{"$f":"Table_2[[#This Row],[Column51]]&Table_2[[#This Row],[Column52]]&BU298","v":""}]
[295,null,null,null,null,null,null,null,null,null,null,null,0,null,null,0,null,null,0,null,null,0,null,null,0,null,null,0,null,null,null,0,null,null,null,{"$f":"IF(AG297<Instructions!D326,AG297,SUM(AG297:AI297))","v":0},null,null,null,{"$f":"IF(AK297<Instructions!D325,AK297,SUM(AK297:AM297))","v":0},null,null,null,{"$f":"IF(AO297<Instructions!D324,AO297,SUM(AO297:AQ297))","v":0},"--",0,{"$f":"SUM(Table_2[[#This Row],[Column20]],Table_2[[#This Row],[Column19]],Table_2[[#This Row],[Column18]])","v":0},"HEALTH & PHY. EDU.",{"$f":"(M297/Instructions!$C$23)*100","v":0},{"$f":"(P297/Instructions!$C$24)*100","v":0},{"$f":"(S297/Instructions!$C$25)*100","v":0},{"$f":"(V297/Instructions!$C$26)*100","v":0},{"$f":"(Y297/Instructions!$C$27)*100","v":0},{"$f":"(AB297/Instructions!$C$28)*100","v":0},{"$f":"(AF297/Instructions!$C$29)*100","v":0},{"$f":"(AJ297/Instructions!$C$30)*100","v":0},{"$f":"(AN297/Instructions!$C$31)*100","v":0},0,{"$f":"(AS297/Instructions!$C$33)*100","v":{"$error":"#VALUE!"}},"----","E","E","E","E","E","E","E","E","E","E","--","E",null,null,null,null,{"$f":"Table_2[[#This Row],[Column51]]&Table_2[[#This Row],[Column52]]&BU299","v":""}]
[296,null,null,null,null,null,null,null,null,null,null,null,0,null,null,0,null,null,0,null,null,0,null,null,0,null,null,0,null,null,null,0,null,null,null,{"$f":"IF(AG298<Instructions!D327,AG298,SUM(AG298:AI298))","v":0},null,null,null,{"$f":"IF(AK298<Instructions!D326,AK298,SUM(AK298:AM298))","v":0},null,null,null,{"$f":"IF(AO298<Instructions!D325,AO298,SUM(AO298:AQ298))","v":0},"--",0,{"$f":"SUM(Table_2[[#This Row],[Column20]],Table_2[[#This Row],[Column19]],Table_2[[#This Row],[Column18]])","v":0},"HEALTH & PHY. EDU.",{"$f":"(M298/Instructions!$C$23)*100","v":0},{"$f":"(P298/Instructions!$C$24)*100","v":0},{"$f":"(S298/Instructions!$C$25)*100","v":0},{"$f":"(V298/Instructions!$C$26)*100","v":0},{"$f":"(Y298/Instructions!$C$27)*100","v":0},{"$f":"(AB298/Instructions!$C$28)*100","v":0},{"$f":"(AF298/Instructions!$C$29)*100","v":0},{"$f":"(AJ298/Instructions!$C$30)*100","v":0},{"$f":"(AN298/Instructions!$C$31)*100","v":0},0,{"$f":"(AS298/Instructions!$C$33)*100","v":{"$error":"#VALUE!"}},"----","E","E","E","E","E","E","E","E","E","E","--","E",null,null,null,null,{"$f":"Table_2[[#This Row],[Column51]]&Table_2[[#This Row],[Column52]]&BU300","v":""}]
[297,null,null,null,null,null,null,null,null,null,null,null,0,null,null,0,null,null,0,null,null,0,null,null,0,null,null,0,null,null,null,0,null,null,null,{"$f":"IF(AG299<Instructions!D328,AG299,SUM(AG299:AI299))","v":0},null,null,null,{"$f":"IF(AK299<Instructions!D327,AK299,SUM(AK299:AM299))","v":0},null,null,null,{"$f":"IF(AO299<Instructions!D326,AO299,SUM(AO299:AQ299))","v":0},"--",0,{"$f":"SUM(Table_2[[#This Row],[Column20]],Table_2[[#This Row],[Column19]],Table_2[[#This Row],[Column18]])","v":0},"HEALTH & PHY. EDU.",{"$f":"(M299/Instructions!$C$23)*100","v":0},{"$f":"(P299/Instructions!$C$24)*100","v":0},{"$f":"(S299/Instructions!$C$25)*100","v":0},{"$f":"(V299/Instructions!$C$26)*100","v":0},{"$f":"(Y299/Instructions!$C$27)*100","v":0},{"$f":"(AB299/Instructions!$C$28)*100","v":0},{"$f":"(AF299/Instructions!$C$29)*100","v":0},{"$f":"(AJ299/Instructions!$C$30)*100","v":0},{"$f":"(AN299/Instructions!$C$31)*100","v":0},0,{"$f":"(AS299/Instructions!$C$33)*100","v":{"$error":"#VALUE!"}},"----","E","E","E","E","E","E","E","E","E","E","--","E",null,null,null,null,{"$f":"Table_2[[#This Row],[Column51]]&Table_2[[#This Row],[Column52]]&BU301","v":""}]
[298,null,null,null,null,null,null,null,null,null,null,null,0,null,null,0,null,null,0,null,null,0,null,null,0,null,null,0,null,null,null,0,null,null,null,{"$f":"IF(AG300<Instructions!D329,AG300,SUM(AG300:AI300))","v":0},null,null,null,{"$f":"IF(AK300<Instructions!D328,AK300,SUM(AK300:AM300))","v":0},null,null,null,{"$f":"IF(AO300<Instructions!D327,AO300,SUM(AO300:AQ300))","v":0},"--",0,{"$f":"SUM(Table_2[[#This Row],[Column20]],Table_2[[#This Row],[Column19]],Table_2[[#This Row],[Column18]])","v":0},"HEALTH & PHY. EDU.",{"$f":"(M300/Instructions!$C$23)*100","v":0},{"$f":"(P300/Instructions!$C$24)*100","v":0},{"$f":"(S300/Instructions!$C$25)*100","v":0},{"$f":"(V300/Instructions!$C$26)*100","v":0},{"$f":"(Y300/Instructions!$C$27)*100","v":0},{"$f":"(AB300/Instructions!$C$28)*100","v":0},{"$f":"(AF300/Instructions!$C$29)*100","v":0},{"$f":"(AJ300/Instructions!$C$30)*100","v":0},{"$f":"(AN300/Instructions!$C$31)*100","v":0},0,{"$f":"(AS300/Instructions!$C$33)*100","v":{"$error":"#VALUE!"}},"----","E","E","E","E","E","E","E","E","E","E","--","E",null,null,null,null,{"$f":"Table_2[[#This Row],[Column51]]&Table_2[[#This Row],[Column52]]&BU302","v":""}]
[299,null,null,null,null,null,null,null,null,null,null,null,0,null,null,0,null,null,0,null,null,0,null,null,0,null,null,0,null,null,null,0,null,null,null,{"$f":"IF(AG301<Instructions!D330,AG301,SUM(AG301:AI301))","v":0},null,null,null,{"$f":"IF(AK301<Instructions!D329,AK301,SUM(AK301:AM301))","v":0},null,null,null,{"$f":"IF(AO301<Instructions!D328,AO301,SUM(AO301:AQ301))","v":0},"--",0,{"$f":"SUM(Table_2[[#This Row],[Column20]],Table_2[[#This Row],[Column19]],Table_2[[#This Row],[Column18]])","v":0},"HEALTH & PHY. EDU.",{"$f":"(M301/Instructions!$C$23)*100","v":0},{"$f":"(P301/Instructions!$C$24)*100","v":0},{"$f":"(S301/Instructions!$C$25)*100","v":0},{"$f":"(V301/Instructions!$C$26)*100","v":0},{"$f":"(Y301/Instructions!$C$27)*100","v":0},{"$f":"(AB301/Instructions!$C$28)*100","v":0},{"$f":"(AF301/Instructions!$C$29)*100","v":0},{"$f":"(AJ301/Instructions!$C$30)*100","v":0},{"$f":"(AN301/Instructions!$C$31)*100","v":0},0,{"$f":"(AS301/Instructions!$C$33)*100","v":{"$error":"#VALUE!"}},"----","E","E","E","E","E","E","E","E","E","E","--","E",null,null,null,null,{"$f":"Table_2[[#This Row],[Column51]]&Table_2[[#This Row],[Column52]]&BU303","v":""}]
[300,null,null,null,null,null,null,null,null,null,null,null,0,null,null,0,null,null,0,null,null,0,null,null,0,null,null,0,null,null,null,0,null,null,null,{"$f":"IF(AG302<Instructions!D331,AG302,SUM(AG302:AI302))","v":0},null,null,null,{"$f":"IF(AK302<Instructions!D330,AK302,SUM(AK302:AM302))","v":0},null,null,null,{"$f":"IF(AO302<Instructions!D329,AO302,SUM(AO302:AQ302))","v":0},"--",0,{"$f":"SUM(Table_2[[#This Row],[Column20]],Table_2[[#This Row],[Column19]],Table_2[[#This Row],[Column18]])","v":0},"HEALTH & PHY. EDU.",{"$f":"(M302/Instructions!$C$23)*100","v":0},{"$f":"(P302/Instructions!$C$24)*100","v":0},{"$f":"(S302/Instructions!$C$25)*100","v":0},{"$f":"(V302/Instructions!$C$26)*100","v":0},{"$f":"(Y302/Instructions!$C$27)*100","v":0},{"$f":"(AB302/Instructions!$C$28)*100","v":0},{"$f":"(AF302/Instructions!$C$29)*100","v":0},{"$f":"(AJ302/Instructions!$C$30)*100","v":0},{"$f":"(AN302/Instructions!$C$31)*100","v":0},0,{"$f":"(AS302/Instructions!$C$33)*100","v":{"$error":"#VALUE!"}},"----","E","E","E","E","E","E","E","E","E","E","--","E",null,null,null,null,{"$f":"Table_2[[#This Row],[Column51]]&Table_2[[#This Row],[Column52]]&BU304","v":""}]
[301,null,null,null,null,null,null,null,null,null,null,null,0,null,null,0,null,null,0,null,null,0,null,null,0,null,null,0,null,null,null,0,null,null,null,{"$f":"IF(AG303<Instructions!D332,AG303,SUM(AG303:AI303))","v":0},null,null,null,{"$f":"IF(AK303<Instructions!D331,AK303,SUM(AK303:AM303))","v":0},null,null,null,{"$f":"IF(AO303<Instructions!D330,AO303,SUM(AO303:AQ303))","v":0},"--",0,{"$f":"SUM(Table_2[[#This Row],[Column20]],Table_2[[#This Row],[Column19]],Table_2[[#This Row],[Column18]])","v":0},"HEALTH & PHY. EDU.",{"$f":"(M303/Instructions!$C$23)*100","v":0},{"$f":"(P303/Instructions!$C$24)*100","v":0},{"$f":"(S303/Instructions!$C$25)*100","v":0},{"$f":"(V303/Instructions!$C$26)*100","v":0},{"$f":"(Y303/Instructions!$C$27)*100","v":0},{"$f":"(AB303/Instructions!$C$28)*100","v":0},{"$f":"(AF303/Instructions!$C$29)*100","v":0},{"$f":"(AJ303/Instructions!$C$30)*100","v":0},{"$f":"(AN303/Instructions!$C$31)*100","v":0},0,{"$f":"(AS303/Instructions!$C$33)*100","v":{"$error":"#VALUE!"}},"----","E","E","E","E","E","E","E","E","E","E","--","E",null,null,null,null,{"$f":"Table_2[[#This Row],[Column51]]&Table_2[[#This Row],[Column52]]&BU305","v":""}]
[302,null,null,null,null,null,null,null,null,null,null,null,0,null,null,0,null,null,0,null,null,0,null,null,0,null,null,0,null,null,null,0,null,null,null,{"$f":"IF(AG304<Instructions!D333,AG304,SUM(AG304:AI304))","v":0},null,null,null,{"$f":"IF(AK304<Instructions!D332,AK304,SUM(AK304:AM304))","v":0},null,null,null,{"$f":"IF(AO304<Instructions!D331,AO304,SUM(AO304:AQ304))","v":0},"--",0,{"$f":"SUM(Table_2[[#This Row],[Column20]],Table_2[[#This Row],[Column19]],Table_2[[#This Row],[Column18]])","v":0},"HEALTH & PHY. EDU.",{"$f":"(M304/Instructions!$C$23)*100","v":0},{"$f":"(P304/Instructions!$C$24)*100","v":0},{"$f":"(S304/Instructions!$C$25)*100","v":0},{"$f":"(V304/Instructions!$C$26)*100","v":0},{"$f":"(Y304/Instructions!$C$27)*100","v":0},{"$f":"(AB304/Instructions!$C$28)*100","v":0},{"$f":"(AF304/Instructions!$C$29)*100","v":0},{"$f":"(AJ304/Instructions!$C$30)*100","v":0},{"$f":"(AN304/Instructions!$C$31)*100","v":0},0,{"$f":"(AS304/Instructions!$C$33)*100","v":{"$error":"#VALUE!"}},"----","E","E","E","E","E","E","E","E","E","E","--","E",null,null,null,null,{"$f":"Table_2[[#This Row],[Column51]]&Table_2[[#This Row],[Column52]]&BU306","v":""}]
[303,null,null,null,null,null,null,null,null,null,null,null,0,null,null,0,null,null,0,null,null,0,null,null,0,null,null,0,null,null,null,0,null,null,null,{"$f":"IF(AG305<Instructions!D334,AG305,SUM(AG305:AI305))","v":0},null,null,null,{"$f":"IF(AK305<Instructions!D333,AK305,SUM(AK305:AM305))","v":0},null,null,null,{"$f":"IF(AO305<Instructions!D332,AO305,SUM(AO305:AQ305))","v":0},"--",0,{"$f":"SUM(Table_2[[#This Row],[Column20]],Table_2[[#This Row],[Column19]],Table_2[[#This Row],[Column18]])","v":0},"HEALTH & PHY. EDU.",{"$f":"(M305/Instructions!$C$23)*100","v":0},{"$f":"(P305/Instructions!$C$24)*100","v":0},{"$f":"(S305/Instructions!$C$25)*100","v":0},{"$f":"(V305/Instructions!$C$26)*100","v":0},{"$f":"(Y305/Instructions!$C$27)*100","v":0},{"$f":"(AB305/Instructions!$C$28)*100","v":0},{"$f":"(AF305/Instructions!$C$29)*100","v":0},{"$f":"(AJ305/Instructions!$C$30)*100","v":0},{"$f":"(AN305/Instructions!$C$31)*100","v":0},0,{"$f":"(AS305/Instructions!$C$33)*100","v":{"$error":"#VALUE!"}},"----","E","E","E","E","E","E","E","E","E","E","--","E",null,null,null,null,{"$f":"Table_2[[#This Row],[Column51]]&Table_2[[#This Row],[Column52]]&BU307","v":""}]
[304,null,null,null,null,null,null,null,null,null,null,null,0,null,null,0,null,null,0,null,null,0,null,null,0,null,null,0,null,null,null,0,null,null,null,{"$f":"IF(AG306<Instructions!D335,AG306,SUM(AG306:AI306))","v":0},null,null,null,{"$f":"IF(AK306<Instructions!D334,AK306,SUM(AK306:AM306))","v":0},null,null,null,{"$f":"IF(AO306<Instructions!D333,AO306,SUM(AO306:AQ306))","v":0},"--",0,{"$f":"SUM(Table_2[[#This Row],[Column20]],Table_2[[#This Row],[Column19]],Table_2[[#This Row],[Column18]])","v":0},"HEALTH & PHY. EDU.",{"$f":"(M306/Instructions!$C$23)*100","v":0},{"$f":"(P306/Instructions!$C$24)*100","v":0},{"$f":"(S306/Instructions!$C$25)*100","v":0},{"$f":"(V306/Instructions!$C$26)*100","v":0},{"$f":"(Y306/Instructions!$C$27)*100","v":0},{"$f":"(AB306/Instructions!$C$28)*100","v":0},{"$f":"(AF306/Instructions!$C$29)*100","v":0},{"$f":"(AJ306/Instructions!$C$30)*100","v":0},{"$f":"(AN306/Instructions!$C$31)*100","v":0},0,{"$f":"(AS306/Instructions!$C$33)*100","v":{"$error":"#VALUE!"}},"----","E","E","E","E","E","E","E","E","E","E","--","E",null,null,null,null,{"$f":"Table_2[[#This Row],[Column51]]&Table_2[[#This Row],[Column52]]&BU308","v":""}]
[305,null,null,null,null,null,null,null,null,null,null,null,0,null,null,0,null,null,0,null,null,0,null,null,0,null,null,0,null,null,null,0,null,null,null,{"$f":"IF(AG307<Instructions!D336,AG307,SUM(AG307:AI307))","v":0},null,null,null,{"$f":"IF(AK307<Instructions!D335,AK307,SUM(AK307:AM307))","v":0},null,null,null,{"$f":"IF(AO307<Instructions!D334,AO307,SUM(AO307:AQ307))","v":0},"--",0,{"$f":"SUM(Table_2[[#This Row],[Column20]],Table_2[[#This Row],[Column19]],Table_2[[#This Row],[Column18]])","v":0},"HEALTH & PHY. EDU.",{"$f":"(M307/Instructions!$C$23)*100","v":0},{"$f":"(P307/Instructions!$C$24)*100","v":0},{"$f":"(S307/Instructions!$C$25)*100","v":0},{"$f":"(V307/Instructions!$C$26)*100","v":0},{"$f":"(Y307/Instructions!$C$27)*100","v":0},{"$f":"(AB307/Instructions!$C$28)*100","v":0},{"$f":"(AF307/Instructions!$C$29)*100","v":0},{"$f":"(AJ307/Instructions!$C$30)*100","v":0},{"$f":"(AN307/Instructions!$C$31)*100","v":0},0,{"$f":"(AS307/Instructions!$C$33)*100","v":{"$error":"#VALUE!"}},"----","E","E","E","E","E","E","E","E","E","E","--","E",null,null,null,null,{"$f":"Table_2[[#This Row],[Column51]]&Table_2[[#This Row],[Column52]]&BU309","v":""}]
[306,null,null,null,null,null,null,null,null,null,null,null,0,null,null,0,null,null,0,null,null,0,null,null,0,null,null,0,null,null,null,0,null,null,null,{"$f":"IF(AG308<Instructions!D337,AG308,SUM(AG308:AI308))","v":0},null,null,null,{"$f":"IF(AK308<Instructions!D336,AK308,SUM(AK308:AM308))","v":0},null,null,null,{"$f":"IF(AO308<Instructions!D335,AO308,SUM(AO308:AQ308))","v":0},"--",0,{"$f":"SUM(Table_2[[#This Row],[Column20]],Table_2[[#This Row],[Column19]],Table_2[[#This Row],[Column18]])","v":0},"HEALTH & PHY. EDU.",{"$f":"(M308/Instructions!$C$23)*100","v":0},{"$f":"(P308/Instructions!$C$24)*100","v":0},{"$f":"(S308/Instructions!$C$25)*100","v":0},{"$f":"(V308/Instructions!$C$26)*100","v":0},{"$f":"(Y308/Instructions!$C$27)*100","v":0},{"$f":"(AB308/Instructions!$C$28)*100","v":0},{"$f":"(AF308/Instructions!$C$29)*100","v":0},{"$f":"(AJ308/Instructions!$C$30)*100","v":0},{"$f":"(AN308/Instructions!$C$31)*100","v":0},0,{"$f":"(AS308/Instructions!$C$33)*100","v":{"$error":"#VALUE!"}},"----","E","E","E","E","E","E","E","E","E","E","--","E",null,null,null,null,{"$f":"Table_2[[#This Row],[Column51]]&Table_2[[#This Row],[Column52]]&BU310","v":""}]
[307,null,null,null,null,null,null,null,null,null,null,null,0,null,null,0,null,null,0,null,null,0,null,null,0,null,null,0,null,null,null,0,null,null,null,{"$f":"IF(AG309<Instructions!D338,AG309,SUM(AG309:AI309))","v":0},null,null,null,{"$f":"IF(AK309<Instructions!D337,AK309,SUM(AK309:AM309))","v":0},null,null,null,{"$f":"IF(AO309<Instructions!D336,AO309,SUM(AO309:AQ309))","v":0},"--",0,{"$f":"SUM(Table_2[[#This Row],[Column20]],Table_2[[#This Row],[Column19]],Table_2[[#This Row],[Column18]])","v":0},"HEALTH & PHY. EDU.",{"$f":"(M309/Instructions!$C$23)*100","v":0},{"$f":"(P309/Instructions!$C$24)*100","v":0},{"$f":"(S309/Instructions!$C$25)*100","v":0},{"$f":"(V309/Instructions!$C$26)*100","v":0},{"$f":"(Y309/Instructions!$C$27)*100","v":0},{"$f":"(AB309/Instructions!$C$28)*100","v":0},{"$f":"(AF309/Instructions!$C$29)*100","v":0},{"$f":"(AJ309/Instructions!$C$30)*100","v":0},{"$f":"(AN309/Instructions!$C$31)*100","v":0},0,{"$f":"(AS309/Instructions!$C$33)*100","v":{"$error":"#VALUE!"}},"----","E","E",{"$f":"IFERROR(IF(AY309>90,\"A+\",IF(AY309>80,\"A\",IF(AY309>70,\"B+\",IF(AY309>60,\"B\",IF(AY309>50,\"C+\",IF(AY309>40,\"C\",IF(AY309>=33,\"D\",\"E\"))))))),\"Abs\")","v":"E"},{"$f":"IFERROR(IF(AZ309>90,\"A+\",IF(AZ309>80,\"A\",IF(AZ309>70,\"B+\",IF(AZ309>60,\"B\",IF(AZ309>50,\"C+\",IF(AZ309>40,\"C\",IF(AZ309>=33,\"D\",\"E\"))))))),\"Abs\")","v":"E"},{"$f":"IFERROR(IF(BA309>90,\"A+\",IF(BA309>80,\"A\",IF(BA309>70,\"B+\",IF(BA309>60,\"B\",IF(BA309>50,\"C+\",IF(BA309>40,\"C\",IF(BA309>=33,\"D\",\"E\"))))))),\"Abs\")","v":"E"},{"$f":"IFERROR(IF(BB309>90,\"A+\",IF(BB309>80,\"A\",IF(BB309>70,\"B+\",IF(BB309>60,\"B\",IF(BB309>50,\"C+\",IF(BB309>40,\"C\",IF(BB309>=33,\"D\",\"E\"))))))),\"Abs\")","v":"E"},{"$f":"IFERROR(IF(BC309>90,\"A+\",IF(BC309>80,\"A\",IF(BC309>70,\"B+\",IF(BC309>60,\"B\",IF(BC309>50,\"C+\",IF(BC309>40,\"C\",IF(BC309>=33,\"D\",\"E\"))))))),\"Abs\")","v":"E"},{"$f":"IFERROR(IF(BD309>90,\"A+\",IF(BD309>80,\"A\",IF(BD309>70,\"B+\",IF(BD309>60,\"B\",IF(BD309>50,\"C+\",IF(BD309>40,\"C\",IF(BD309>=33,\"D\",\"E\"))))))),\"Abs\")","v":"E"},{"$f":"IFERROR(IF(BE309>90,\"A+\",IF(BE309>80,\"A\",IF(BE309>70,\"B+\",IF(BE309>60,\"B\",IF(BE309>50,\"C+\",IF(BE309>40,\"C\",IF(BE309>=33,\"D\",\"E\"))))))),\"Abs\")","v":"E"},{"$f":"IFERROR(IF(BF309>90,\"A+\",IF(BF309>80,\"A\",IF(BF309>70,\"B+\",IF(BF309>60,\"B\",IF(BF309>50,\"C+\",IF(BF309>40,\"C\",IF(BF309>=33,\"D\",\"E\"))))))),\"Abs\")","v":"E"},"--","E",null,null,null,null,{"$f":"Table_2[[#This Row],[Column51]]&Table_2[[#This Row],[Column52]]&BU311","v":""}]
[308,null,null,null,null,null,null,null,null,null,null,null,0,null,null,0,null,null,0,null,null,0,null,null,0,null,null,0,null,null,null,0,null,null,null,{"$f":"IF(AG310<Instructions!D339,AG310,SUM(AG310:AI310))","v":0},null,null,null,{"$f":"IF(AK310<Instructions!D338,AK310,SUM(AK310:AM310))","v":0},null,null,null,{"$f":"IF(AO310<Instructions!D337,AO310,SUM(AO310:AQ310))","v":0},"--",0,{"$f":"SUM(Table_2[[#This Row],[Column20]],Table_2[[#This Row],[Column19]],Table_2[[#This Row],[Column18]])","v":0},"HEALTH & PHY. EDU.",{"$f":"(M310/Instructions!$C$23)*100","v":0},{"$f":"(P310/Instructions!$C$24)*100","v":0},{"$f":"(S310/Instructions!$C$25)*100","v":0},{"$f":"(V310/Instructions!$C$26)*100","v":0},{"$f":"(Y310/Instructions!$C$27)*100","v":0},{"$f":"(AB310/Instructions!$C$28)*100","v":0},{"$f":"(AF310/Instructions!$C$29)*100","v":0},{"$f":"(AJ310/Instructions!$C$30)*100","v":0},{"$f":"(AN310/Instructions!$C$31)*100","v":0},0,{"$f":"(AS310/Instructions!$C$33)*100","v":{"$error":"#VALUE!"}},"----","E","E","E","E","E","E","E","E","E","E","--","E",null,null,null,null,{"$f":"Table_2[[#This Row],[Column51]]&Table_2[[#This Row],[Column52]]&BU312","v":""}]
[309,null,null,null,null,null,null,null,null,null,null,null,0,null,null,0,null,null,0,null,null,0,null,null,0,null,null,0,null,null,null,0,null,null,null,{"$f":"IF(AG311<Instructions!D340,AG311,SUM(AG311:AI311))","v":0},null,null,null,{"$f":"IF(AK311<Instructions!D339,AK311,SUM(AK311:AM311))","v":0},null,null,null,{"$f":"IF(AO311<Instructions!D338,AO311,SUM(AO311:AQ311))","v":0},"--",0,{"$f":"SUM(Table_2[[#This Row],[Column20]],Table_2[[#This Row],[Column19]],Table_2[[#This Row],[Column18]])","v":0},"HEALTH & PHY. EDU.",{"$f":"(M311/Instructions!$C$23)*100","v":0},{"$f":"(P311/Instructions!$C$24)*100","v":0},{"$f":"(S311/Instructions!$C$25)*100","v":0},{"$f":"(V311/Instructions!$C$26)*100","v":0},{"$f":"(Y311/Instructions!$C$27)*100","v":0},{"$f":"(AB311/Instructions!$C$28)*100","v":0},{"$f":"(AF311/Instructions!$C$29)*100","v":0},{"$f":"(AJ311/Instructions!$C$30)*100","v":0},{"$f":"(AN311/Instructions!$C$31)*100","v":0},0,{"$f":"(AS311/Instructions!$C$33)*100","v":{"$error":"#VALUE!"}},"----","E","E","E","E","E","E","E","E","E","E","--","E",null,null,null,null,{"$f":"Table_2[[#This Row],[Column51]]&Table_2[[#This Row],[Column52]]&BU313","v":""}]
[310,null,null,null,null,null,null,null,null,null,null,null,0,null,null,0,null,null,0,null,null,0,null,null,0,null,null,0,null,null,null,0,null,null,null,{"$f":"IF(AG312<Instructions!D341,AG312,SUM(AG312:AI312))","v":0},null,null,null,{"$f":"IF(AK312<Instructions!D340,AK312,SUM(AK312:AM312))","v":0},null,null,null,{"$f":"IF(AO312<Instructions!D339,AO312,SUM(AO312:AQ312))","v":0},"--",0,{"$f":"SUM(Table_2[[#This Row],[Column20]],Table_2[[#This Row],[Column19]],Table_2[[#This Row],[Column18]])","v":0},"HEALTH & PHY. EDU.",{"$f":"(M312/Instructions!$C$23)*100","v":0},{"$f":"(P312/Instructions!$C$24)*100","v":0},{"$f":"(S312/Instructions!$C$25)*100","v":0},{"$f":"(V312/Instructions!$C$26)*100","v":0},{"$f":"(Y312/Instructions!$C$27)*100","v":0},{"$f":"(AB312/Instructions!$C$28)*100","v":0},{"$f":"(AF312/Instructions!$C$29)*100","v":0},{"$f":"(AJ312/Instructions!$C$30)*100","v":0},{"$f":"(AN312/Instructions!$C$31)*100","v":0},0,{"$f":"(AS312/Instructions!$C$33)*100","v":{"$error":"#VALUE!"}},"----","E","E","E","E","E","E","E","E","E","E","--","E",null,null,null,null,{"$f":"Table_2[[#This Row],[Column51]]&Table_2[[#This Row],[Column52]]&BU314","v":""}]
[311,null,null,null,null,null,null,null,null,null,null,null,0,null,null,0,null,null,0,null,null,0,null,null,0,null,null,0,null,null,null,0,null,null,null,{"$f":"IF(AG313<Instructions!D342,AG313,SUM(AG313:AI313))","v":0},null,null,null,{"$f":"IF(AK313<Instructions!D341,AK313,SUM(AK313:AM313))","v":0},null,null,null,{"$f":"IF(AO313<Instructions!D340,AO313,SUM(AO313:AQ313))","v":0},"--",0,{"$f":"SUM(Table_2[[#This Row],[Column20]],Table_2[[#This Row],[Column19]],Table_2[[#This Row],[Column18]])","v":0},"HEALTH & PHY. EDU.",{"$f":"(M313/Instructions!$C$23)*100","v":0},{"$f":"(P313/Instructions!$C$24)*100","v":0},{"$f":"(S313/Instructions!$C$25)*100","v":0},{"$f":"(V313/Instructions!$C$26)*100","v":0},{"$f":"(Y313/Instructions!$C$27)*100","v":0},{"$f":"(AB313/Instructions!$C$28)*100","v":0},{"$f":"(AF313/Instructions!$C$29)*100","v":0},{"$f":"(AJ313/Instructions!$C$30)*100","v":0},{"$f":"(AN313/Instructions!$C$31)*100","v":0},0,{"$f":"(AS313/Instructions!$C$33)*100","v":{"$error":"#VALUE!"}},"----","E","E","E","E","E","E","E","E","E","E","--","E",null,null,null,null,{"$f":"Table_2[[#This Row],[Column51]]&Table_2[[#This Row],[Column52]]&BU315","v":""}]
[312,null,null,null,null,null,null,null,null,null,null,null,0,null,null,0,null,null,0,null,null,0,null,null,0,null,null,0,null,null,null,0,null,null,null,{"$f":"IF(AG314<Instructions!D343,AG314,SUM(AG314:AI314))","v":0},null,null,null,{"$f":"IF(AK314<Instructions!D342,AK314,SUM(AK314:AM314))","v":0},null,null,null,{"$f":"IF(AO314<Instructions!D341,AO314,SUM(AO314:AQ314))","v":0},"--",0,{"$f":"SUM(Table_2[[#This Row],[Column20]],Table_2[[#This Row],[Column19]],Table_2[[#This Row],[Column18]])","v":0},"HEALTH & PHY. EDU.",{"$f":"(M314/Instructions!$C$23)*100","v":0},{"$f":"(P314/Instructions!$C$24)*100","v":0},{"$f":"(S314/Instructions!$C$25)*100","v":0},{"$f":"(V314/Instructions!$C$26)*100","v":0},{"$f":"(Y314/Instructions!$C$27)*100","v":0},{"$f":"(AB314/Instructions!$C$28)*100","v":0},{"$f":"(AF314/Instructions!$C$29)*100","v":0},{"$f":"(AJ314/Instructions!$C$30)*100","v":0},{"$f":"(AN314/Instructions!$C$31)*100","v":0},0,{"$f":"(AS314/Instructions!$C$33)*100","v":{"$error":"#VALUE!"}},"----","E","E","E","E","E","E","E","E","E","E","--","E",null,null,null,null,{"$f":"Table_2[[#This Row],[Column51]]&Table_2[[#This Row],[Column52]]&BU316","v":""}]
[313,null,null,null,null,null,null,null,null,null,null,null,0,null,null,0,null,null,0,null,null,0,null,null,0,null,null,0,null,null,null,0,null,null,null,{"$f":"IF(AG315<Instructions!D344,AG315,SUM(AG315:AI315))","v":0},null,null,null,{"$f":"IF(AK315<Instructions!D343,AK315,SUM(AK315:AM315))","v":0},null,null,null,{"$f":"IF(AO315<Instructions!D342,AO315,SUM(AO315:AQ315))","v":0},"--",0,{"$f":"SUM(Table_2[[#This Row],[Column20]],Table_2[[#This Row],[Column19]],Table_2[[#This Row],[Column18]])","v":0},"HEALTH & PHY. EDU.",{"$f":"(M315/Instructions!$C$23)*100","v":0},{"$f":"(P315/Instructions!$C$24)*100","v":0},{"$f":"(S315/Instructions!$C$25)*100","v":0},{"$f":"(V315/Instructions!$C$26)*100","v":0},{"$f":"(Y315/Instructions!$C$27)*100","v":0},{"$f":"(AB315/Instructions!$C$28)*100","v":0},{"$f":"(AF315/Instructions!$C$29)*100","v":0},{"$f":"(AJ315/Instructions!$C$30)*100","v":0},{"$f":"(AN315/Instructions!$C$31)*100","v":0},0,{"$f":"(AS315/Instructions!$C$33)*100","v":{"$error":"#VALUE!"}},"----","E","E","E","E","E","E","E","E","E","E","--","E",null,null,null,null,{"$f":"Table_2[[#This Row],[Column51]]&Table_2[[#This Row],[Column52]]&BU317","v":""}]
[314,null,null,null,null,null,null,null,null,null,null,null,0,null,null,0,null,null,0,null,null,0,null,null,0,null,null,0,null,null,null,0,null,null,null,{"$f":"IF(AG316<Instructions!D345,AG316,SUM(AG316:AI316))","v":0},null,null,null,{"$f":"IF(AK316<Instructions!D344,AK316,SUM(AK316:AM316))","v":0},null,null,null,{"$f":"IF(AO316<Instructions!D343,AO316,SUM(AO316:AQ316))","v":0},"--",0,{"$f":"SUM(Table_2[[#This Row],[Column20]],Table_2[[#This Row],[Column19]],Table_2[[#This Row],[Column18]])","v":0},"HEALTH & PHY. EDU.",{"$f":"(M316/Instructions!$C$23)*100","v":0},{"$f":"(P316/Instructions!$C$24)*100","v":0},{"$f":"(S316/Instructions!$C$25)*100","v":0},{"$f":"(V316/Instructions!$C$26)*100","v":0},{"$f":"(Y316/Instructions!$C$27)*100","v":0},{"$f":"(AB316/Instructions!$C$28)*100","v":0},{"$f":"(AF316/Instructions!$C$29)*100","v":0},{"$f":"(AJ316/Instructions!$C$30)*100","v":0},{"$f":"(AN316/Instructions!$C$31)*100","v":0},0,{"$f":"(AS316/Instructions!$C$33)*100","v":{"$error":"#VALUE!"}},"----","E","E","E","E","E","E","E","E","E","E","--","E",null,null,null,null,{"$f":"Table_2[[#This Row],[Column51]]&Table_2[[#This Row],[Column52]]&BU318","v":""}]
[315,null,null,null,null,null,null,null,null,null,null,null,0,null,null,0,null,null,0,null,null,0,null,null,0,null,null,0,null,null,null,0,null,null,null,{"$f":"IF(AG317<Instructions!D346,AG317,SUM(AG317:AI317))","v":0},null,null,null,{"$f":"IF(AK317<Instructions!D345,AK317,SUM(AK317:AM317))","v":0},null,null,null,{"$f":"IF(AO317<Instructions!D344,AO317,SUM(AO317:AQ317))","v":0},"--",0,{"$f":"SUM(Table_2[[#This Row],[Column20]],Table_2[[#This Row],[Column19]],Table_2[[#This Row],[Column18]])","v":0},"HEALTH & PHY. EDU.",{"$f":"(M317/Instructions!$C$23)*100","v":0},{"$f":"(P317/Instructions!$C$24)*100","v":0},{"$f":"(S317/Instructions!$C$25)*100","v":0},{"$f":"(V317/Instructions!$C$26)*100","v":0},{"$f":"(Y317/Instructions!$C$27)*100","v":0},{"$f":"(AB317/Instructions!$C$28)*100","v":0},{"$f":"(AF317/Instructions!$C$29)*100","v":0},{"$f":"(AJ317/Instructions!$C$30)*100","v":0},{"$f":"(AN317/Instructions!$C$31)*100","v":0},0,{"$f":"(AS317/Instructions!$C$33)*100","v":{"$error":"#VALUE!"}},"----","E","E","E","E","E","E","E","E","E","E","--","E",null,null,null,null,{"$f":"Table_2[[#This Row],[Column51]]&Table_2[[#This Row],[Column52]]&BU319","v":""}]
[316,null,null,null,null,null,null,null,null,null,null,null,0,null,null,0,null,null,0,null,null,0,null,null,0,null,null,0,null,null,null,0,null,null,null,{"$f":"IF(AG318<Instructions!D347,AG318,SUM(AG318:AI318))","v":0},null,null,null,{"$f":"IF(AK318<Instructions!D346,AK318,SUM(AK318:AM318))","v":0},null,null,null,{"$f":"IF(AO318<Instructions!D345,AO318,SUM(AO318:AQ318))","v":0},"--",0,{"$f":"SUM(Table_2[[#This Row],[Column20]],Table_2[[#This Row],[Column19]],Table_2[[#This Row],[Column18]])","v":0},"HEALTH & PHY. EDU.",{"$f":"(M318/Instructions!$C$23)*100","v":0},{"$f":"(P318/Instructions!$C$24)*100","v":0},{"$f":"(S318/Instructions!$C$25)*100","v":0},{"$f":"(V318/Instructions!$C$26)*100","v":0},{"$f":"(Y318/Instructions!$C$27)*100","v":0},{"$f":"(AB318/Instructions!$C$28)*100","v":0},{"$f":"(AF318/Instructions!$C$29)*100","v":0},{"$f":"(AJ318/Instructions!$C$30)*100","v":0},{"$f":"(AN318/Instructions!$C$31)*100","v":0},0,{"$f":"(AS318/Instructions!$C$33)*100","v":{"$error":"#VALUE!"}},"----","E","E","E","E","E","E","E","E","E","E","--","E",null,null,null,null,{"$f":"Table_2[[#This Row],[Column51]]&Table_2[[#This Row],[Column52]]&BU320","v":""}]
[317,null,null,null,null,null,null,null,null,null,null,null,0,null,null,0,null,null,0,null,null,0,null,null,0,null,null,0,null,null,null,0,null,null,null,{"$f":"IF(AG319<Instructions!D348,AG319,SUM(AG319:AI319))","v":0},null,null,null,{"$f":"IF(AK319<Instructions!D347,AK319,SUM(AK319:AM319))","v":0},null,null,null,{"$f":"IF(AO319<Instructions!D346,AO319,SUM(AO319:AQ319))","v":0},"--",0,{"$f":"SUM(Table_2[[#This Row],[Column20]],Table_2[[#This Row],[Column19]],Table_2[[#This Row],[Column18]])","v":0},"HEALTH & PHY. EDU.",{"$f":"(M319/Instructions!$C$23)*100","v":0},{"$f":"(P319/Instructions!$C$24)*100","v":0},{"$f":"(S319/Instructions!$C$25)*100","v":0},{"$f":"(V319/Instructions!$C$26)*100","v":0},{"$f":"(Y319/Instructions!$C$27)*100","v":0},{"$f":"(AB319/Instructions!$C$28)*100","v":0},{"$f":"(AF319/Instructions!$C$29)*100","v":0},{"$f":"(AJ319/Instructions!$C$30)*100","v":0},{"$f":"(AN319/Instructions!$C$31)*100","v":0},0,{"$f":"(AS319/Instructions!$C$33)*100","v":{"$error":"#VALUE!"}},"----","E","E","E","E","E","E","E","E","E","E","--","E",null,null,null,null,{"$f":"Table_2[[#This Row],[Column51]]&Table_2[[#This Row],[Column52]]&BU321","v":""}]
[318,null,null,null,null,null,null,null,null,null,null,null,0,null,null,0,null,null,0,null,null,0,null,null,0,null,null,0,null,null,null,0,null,null,null,{"$f":"IF(AG320<Instructions!D349,AG320,SUM(AG320:AI320))","v":0},null,null,null,{"$f":"IF(AK320<Instructions!D348,AK320,SUM(AK320:AM320))","v":0},null,null,null,{"$f":"IF(AO320<Instructions!D347,AO320,SUM(AO320:AQ320))","v":0},"--",0,{"$f":"SUM(Table_2[[#This Row],[Column20]],Table_2[[#This Row],[Column19]],Table_2[[#This Row],[Column18]])","v":0},"HEALTH & PHY. EDU.",{"$f":"(M320/Instructions!$C$23)*100","v":0},{"$f":"(P320/Instructions!$C$24)*100","v":0},{"$f":"(S320/Instructions!$C$25)*100","v":0},{"$f":"(V320/Instructions!$C$26)*100","v":0},{"$f":"(Y320/Instructions!$C$27)*100","v":0},{"$f":"(AB320/Instructions!$C$28)*100","v":0},{"$f":"(AF320/Instructions!$C$29)*100","v":0},{"$f":"(AJ320/Instructions!$C$30)*100","v":0},{"$f":"(AN320/Instructions!$C$31)*100","v":0},0,{"$f":"(AS320/Instructions!$C$33)*100","v":{"$error":"#VALUE!"}},"----","E","E","E","E","E","E","E","E","E","E","--","E",null,null,null,null,{"$f":"Table_2[[#This Row],[Column51]]&Table_2[[#This Row],[Column52]]&BU322","v":""}]
[319,null,null,null,null,null,null,null,null,null,null,null,0,null,null,0,null,null,0,null,null,0,null,null,0,null,null,0,null,null,null,0,null,null,null,{"$f":"IF(AG321<Instructions!D350,AG321,SUM(AG321:AI321))","v":0},null,null,null,{"$f":"IF(AK321<Instructions!D349,AK321,SUM(AK321:AM321))","v":0},null,null,null,{"$f":"IF(AO321<Instructions!D348,AO321,SUM(AO321:AQ321))","v":0},"--",0,{"$f":"SUM(Table_2[[#This Row],[Column20]],Table_2[[#This Row],[Column19]],Table_2[[#This Row],[Column18]])","v":0},"HEALTH & PHY. EDU.",{"$f":"(M321/Instructions!$C$23)*100","v":0},{"$f":"(P321/Instructions!$C$24)*100","v":0},{"$f":"(S321/Instructions!$C$25)*100","v":0},{"$f":"(V321/Instructions!$C$26)*100","v":0},{"$f":"(Y321/Instructions!$C$27)*100","v":0},{"$f":"(AB321/Instructions!$C$28)*100","v":0},{"$f":"(AF321/Instructions!$C$29)*100","v":0},{"$f":"(AJ321/Instructions!$C$30)*100","v":0},{"$f":"(AN321/Instructions!$C$31)*100","v":0},0,{"$f":"(AS321/Instructions!$C$33)*100","v":{"$error":"#VALUE!"}},"----","E","E","E","E","E","E","E","E","E","E","--","E",null,null,null,null,{"$f":"Table_2[[#This Row],[Column51]]&Table_2[[#This Row],[Column52]]&BU323","v":""}]
[320,null,null,null,null,null,null,null,null,null,null,null,0,null,null,0,null,null,0,null,null,0,null,null,0,null,null,0,null,null,null,0,null,null,null,{"$f":"IF(AG322<Instructions!D351,AG322,SUM(AG322:AI322))","v":0},null,null,null,{"$f":"IF(AK322<Instructions!D350,AK322,SUM(AK322:AM322))","v":0},null,null,null,{"$f":"IF(AO322<Instructions!D349,AO322,SUM(AO322:AQ322))","v":0},"--",0,{"$f":"SUM(Table_2[[#This Row],[Column20]],Table_2[[#This Row],[Column19]],Table_2[[#This Row],[Column18]])","v":0},"HEALTH & PHY. EDU.",{"$f":"(M322/Instructions!$C$23)*100","v":0},{"$f":"(P322/Instructions!$C$24)*100","v":0},{"$f":"(S322/Instructions!$C$25)*100","v":0},{"$f":"(V322/Instructions!$C$26)*100","v":0},{"$f":"(Y322/Instructions!$C$27)*100","v":0},{"$f":"(AB322/Instructions!$C$28)*100","v":0},{"$f":"(AF322/Instructions!$C$29)*100","v":0},{"$f":"(AJ322/Instructions!$C$30)*100","v":0},{"$f":"(AN322/Instructions!$C$31)*100","v":0},0,{"$f":"(AS322/Instructions!$C$33)*100","v":{"$error":"#VALUE!"}},"----","E","E","E","E","E","E","E","E","E","E","--","E",null,null,null,null,{"$f":"Table_2[[#This Row],[Column51]]&Table_2[[#This Row],[Column52]]&BU324","v":""}]
[321,null,null,null,null,null,null,null,null,null,null,null,0,null,null,0,null,null,0,null,null,0,null,null,0,null,null,0,null,null,null,0,null,null,null,{"$f":"IF(AG323<Instructions!D352,AG323,SUM(AG323:AI323))","v":0},null,null,null,{"$f":"IF(AK323<Instructions!D351,AK323,SUM(AK323:AM323))","v":0},null,null,null,{"$f":"IF(AO323<Instructions!D350,AO323,SUM(AO323:AQ323))","v":0},"--",0,{"$f":"SUM(Table_2[[#This Row],[Column20]],Table_2[[#This Row],[Column19]],Table_2[[#This Row],[Column18]])","v":0},"HEALTH & PHY. EDU.",{"$f":"(M323/Instructions!$C$23)*100","v":0},{"$f":"(P323/Instructions!$C$24)*100","v":0},{"$f":"(S323/Instructions!$C$25)*100","v":0},{"$f":"(V323/Instructions!$C$26)*100","v":0},{"$f":"(Y323/Instructions!$C$27)*100","v":0},{"$f":"(AB323/Instructions!$C$28)*100","v":0},{"$f":"(AF323/Instructions!$C$29)*100","v":0},{"$f":"(AJ323/Instructions!$C$30)*100","v":0},{"$f":"(AN323/Instructions!$C$31)*100","v":0},0,{"$f":"(AS323/Instructions!$C$33)*100","v":{"$error":"#VALUE!"}},"----","E","E","E","E","E","E","E","E","E","E","--","E",null,null,null,null,{"$f":"Table_2[[#This Row],[Column51]]&Table_2[[#This Row],[Column52]]&BU325","v":""}]
[322,null,null,null,null,null,null,null,null,null,null,null,{"$f":"IF(K324<33,K324,SUM(K324:L324))","v":0},null,null,{"$f":"IF(N324<20,N324,SUM(N324:O324))","v":0},null,null,{"$f":"IF(Q324<20,Q324,SUM(Q324:R324))","v":0},null,null,{"$f":"IF(T324<20,T324,SUM(T324:U324))","v":0},null,null,{"$f":"IF(W324<20,W324,SUM(W324:X324))","v":0},null,null,{"$f":"IF(Z324<20,Z324,SUM(Z324:AA324))","v":0},null,null,null,{"$f":"IF(AC324<10,AC324,SUM(AC324:AE324))","v":0},null,null,null,{"$f":"IF(AG324<Instructions!D353,AG324,SUM(AG324:AI324))","v":0},null,null,null,{"$f":"IF(AK324<Instructions!D352,AK324,SUM(AK324:AM324))","v":0},null,null,null,{"$f":"IF(AO324<Instructions!D351,AO324,SUM(AO324:AQ324))","v":0},{"$f":"IF(MIN(M324,P324,S324,V324,Y324,AB324)>=33,SUM(M324,P324,S324,V324,Y324,AB324),\"--\")","v":"--"},{"$f":"IF(AS324=\"--\",0,AS324)","v":0},{"$f":"SUM(Table_2[[#This Row],[Column20]],Table_2[[#This Row],[Column19]],Table_2[[#This Row],[Column18]])","v":0},{"$f":"IF(N(AJ324)>0,$AG$1,IF(N(AN324)>0,$AK$1,$AO$1))","v":"HEALTH & PHY. EDU."},{"$f":"(M324/Instructions!$C$23)*100","v":0},{"$f":"(P324/Instructions!$C$24)*100","v":0},{"$f":"(S324/Instructions!$C$25)*100","v":0},{"$f":"(V324/Instructions!$C$26)*100","v":0},{"$f":"(Y324/Instructions!$C$27)*100","v":0},{"$f":"(AB324/Instructions!$C$28)*100","v":0},{"$f":"(AF324/Instructions!$C$29)*100","v":0},{"$f":"(AJ324/Instructions!$C$30)*100","v":0},{"$f":"(AN324/Instructions!$C$31)*100","v":0},{"$f":"(AR324/100)*100","v":0},{"$f":"(AS324/Instructions!$C$33)*100","v":{"$error":"#VALUE!"}},{"$f":"IF(AND(AW324>=33,AX324>=33,AY324>=33,AZ324>=33,BA324>=33,BB324>=33),\"PASS\",\"----\")","v":"----"},"E","E","E","E","E","E","E","E","E","E",{"$f":"IFERROR(IF(BG324>90,\"A+\",IF(BG324>80,\"A\",IF(BG324>70,\"B+\",IF(BG324>60,\"B\",IF(BG324>50,\"C+\",IF(BG324>40,\"C\",IF(BG324>=33,\"D\",\"E\"))))))),\"--\")","v":"--"},{"$f":"IFERROR(IF(BF324>90,\"A+\",IF(BF324>80,\"A\",IF(BF324>70,\"B+\",IF(BF324>60,\"B\",IF(BF324>50,\"C+\",IF(BF324>40,\"C\",IF(BF324>=33,\"D\",\"E\"))))))),\"Abs\")","v":"E"},null,null,null,null,{"$f":"Table_2[[#This Row],[Column51]]&Table_2[[#This Row],[Column52]]&BU326","v":""}]
[323,null,null,null,null,null,null,null,null,null,null,null,0,null,null,0,null,null,0,null,null,0,null,null,0,null,null,0,null,null,null,0,null,null,null,{"$f":"IF(AG325<Instructions!D354,AG325,SUM(AG325:AI325))","v":0},null,null,null,{"$f":"IF(AK325<Instructions!D353,AK325,SUM(AK325:AM325))","v":0},null,null,null,{"$f":"IF(AO325<Instructions!D352,AO325,SUM(AO325:AQ325))","v":0},"--",0,{"$f":"SUM(Table_2[[#This Row],[Column20]],Table_2[[#This Row],[Column19]],Table_2[[#This Row],[Column18]])","v":0},"HEALTH & PHY. EDU.",{"$f":"(M325/Instructions!$C$23)*100","v":0},{"$f":"(P325/Instructions!$C$24)*100","v":0},{"$f":"(S325/Instructions!$C$25)*100","v":0},{"$f":"(V325/Instructions!$C$26)*100","v":0},{"$f":"(Y325/Instructions!$C$27)*100","v":0},{"$f":"(AB325/Instructions!$C$28)*100","v":0},{"$f":"(AF325/Instructions!$C$29)*100","v":0},{"$f":"(AJ325/Instructions!$C$30)*100","v":0},{"$f":"(AN325/Instructions!$C$31)*100","v":0},0,{"$f":"(AS325/Instructions!$C$33)*100","v":{"$error":"#VALUE!"}},"----","E","E","E","E","E","E","E","E","E","E","--","E",null,null,null,null,{"$f":"Table_2[[#This Row],[Column51]]&Table_2[[#This Row],[Column52]]&BU327","v":""}]
[324,null,null,null,null,null,null,null,null,null,null,null,0,null,null,0,null,null,0,null,null,0,null,null,0,null,null,0,null,null,null,0,null,null,null,{"$f":"IF(AG326<Instructions!D355,AG326,SUM(AG326:AI326))","v":0},null,null,null,{"$f":"IF(AK326<Instructions!D354,AK326,SUM(AK326:AM326))","v":0},null,null,null,{"$f":"IF(AO326<Instructions!D353,AO326,SUM(AO326:AQ326))","v":0},"--",0,{"$f":"SUM(Table_2[[#This Row],[Column20]],Table_2[[#This Row],[Column19]],Table_2[[#This Row],[Column18]])","v":0},"HEALTH & PHY. EDU.",{"$f":"(M326/Instructions!$C$23)*100","v":0},{"$f":"(P326/Instructions!$C$24)*100","v":0},{"$f":"(S326/Instructions!$C$25)*100","v":0},{"$f":"(V326/Instructions!$C$26)*100","v":0},{"$f":"(Y326/Instructions!$C$27)*100","v":0},{"$f":"(AB326/Instructions!$C$28)*100","v":0},{"$f":"(AF326/Instructions!$C$29)*100","v":0},{"$f":"(AJ326/Instructions!$C$30)*100","v":0},{"$f":"(AN326/Instructions!$C$31)*100","v":0},0,{"$f":"(AS326/Instructions!$C$33)*100","v":{"$error":"#VALUE!"}},"----","E","E","E","E","E","E","E","E","E","E","--","E",null,null,null,null,{"$f":"Table_2[[#This Row],[Column51]]&Table_2[[#This Row],[Column52]]&BU328","v":""}]
[325,null,null,null,null,null,null,null,null,null,null,null,0,null,null,0,null,null,0,null,null,0,null,null,0,null,null,0,null,null,null,0,null,null,null,{"$f":"IF(AG327<Instructions!D356,AG327,SUM(AG327:AI327))","v":0},null,null,null,{"$f":"IF(AK327<Instructions!D355,AK327,SUM(AK327:AM327))","v":0},null,null,null,{"$f":"IF(AO327<Instructions!D354,AO327,SUM(AO327:AQ327))","v":0},"--",0,{"$f":"SUM(Table_2[[#This Row],[Column20]],Table_2[[#This Row],[Column19]],Table_2[[#This Row],[Column18]])","v":0},"HEALTH & PHY. EDU.",{"$f":"(M327/Instructions!$C$23)*100","v":0},{"$f":"(P327/Instructions!$C$24)*100","v":0},{"$f":"(S327/Instructions!$C$25)*100","v":0},{"$f":"(V327/Instructions!$C$26)*100","v":0},{"$f":"(Y327/Instructions!$C$27)*100","v":0},{"$f":"(AB327/Instructions!$C$28)*100","v":0},{"$f":"(AF327/Instructions!$C$29)*100","v":0},{"$f":"(AJ327/Instructions!$C$30)*100","v":0},{"$f":"(AN327/Instructions!$C$31)*100","v":0},0,{"$f":"(AS327/Instructions!$C$33)*100","v":{"$error":"#VALUE!"}},"----","E","E","E","E","E","E","E","E","E","E","--","E",null,null,null,null,{"$f":"Table_2[[#This Row],[Column51]]&Table_2[[#This Row],[Column52]]&BU329","v":""}]
[326,null,null,null,null,null,null,null,null,null,null,null,0,null,null,0,null,null,0,null,null,0,null,null,0,null,null,0,null,null,null,0,null,null,null,{"$f":"IF(AG328<Instructions!D357,AG328,SUM(AG328:AI328))","v":0},null,null,null,{"$f":"IF(AK328<Instructions!D356,AK328,SUM(AK328:AM328))","v":0},null,null,null,{"$f":"IF(AO328<Instructions!D355,AO328,SUM(AO328:AQ328))","v":0},"--",0,{"$f":"SUM(Table_2[[#This Row],[Column20]],Table_2[[#This Row],[Column19]],Table_2[[#This Row],[Column18]])","v":0},"HEALTH & PHY. EDU.",{"$f":"(M328/Instructions!$C$23)*100","v":0},{"$f":"(P328/Instructions!$C$24)*100","v":0},{"$f":"(S328/Instructions!$C$25)*100","v":0},{"$f":"(V328/Instructions!$C$26)*100","v":0},{"$f":"(Y328/Instructions!$C$27)*100","v":0},{"$f":"(AB328/Instructions!$C$28)*100","v":0},{"$f":"(AF328/Instructions!$C$29)*100","v":0},{"$f":"(AJ328/Instructions!$C$30)*100","v":0},{"$f":"(AN328/Instructions!$C$31)*100","v":0},0,{"$f":"(AS328/Instructions!$C$33)*100","v":{"$error":"#VALUE!"}},"----","E","E","E","E","E","E","E","E","E","E","--","E",null,null,null,null,{"$f":"Table_2[[#This Row],[Column51]]&Table_2[[#This Row],[Column52]]&BU330","v":""}]
[327,null,null,null,null,null,null,null,null,null,null,null,0,null,null,0,null,null,0,null,null,0,null,null,0,null,null,0,null,null,null,0,null,null,null,{"$f":"IF(AG329<Instructions!D358,AG329,SUM(AG329:AI329))","v":0},null,null,null,{"$f":"IF(AK329<Instructions!D357,AK329,SUM(AK329:AM329))","v":0},null,null,null,{"$f":"IF(AO329<Instructions!D356,AO329,SUM(AO329:AQ329))","v":0},"--",0,{"$f":"SUM(Table_2[[#This Row],[Column20]],Table_2[[#This Row],[Column19]],Table_2[[#This Row],[Column18]])","v":0},"HEALTH & PHY. EDU.",{"$f":"(M329/Instructions!$C$23)*100","v":0},{"$f":"(P329/Instructions!$C$24)*100","v":0},{"$f":"(S329/Instructions!$C$25)*100","v":0},{"$f":"(V329/Instructions!$C$26)*100","v":0},{"$f":"(Y329/Instructions!$C$27)*100","v":0},{"$f":"(AB329/Instructions!$C$28)*100","v":0},{"$f":"(AF329/Instructions!$C$29)*100","v":0},{"$f":"(AJ329/Instructions!$C$30)*100","v":0},{"$f":"(AN329/Instructions!$C$31)*100","v":0},0,{"$f":"(AS329/Instructions!$C$33)*100","v":{"$error":"#VALUE!"}},"----","E","E","E","E","E","E","E","E","E","E","--","E",null,null,null,null,{"$f":"Table_2[[#This Row],[Column51]]&Table_2[[#This Row],[Column52]]&BU331","v":""}]
[328,null,null,null,null,null,null,null,null,null,null,null,0,null,null,0,null,null,0,null,null,0,null,null,0,null,null,0,null,null,null,0,null,null,null,{"$f":"IF(AG330<Instructions!D359,AG330,SUM(AG330:AI330))","v":0},null,null,null,{"$f":"IF(AK330<Instructions!D358,AK330,SUM(AK330:AM330))","v":0},null,null,null,{"$f":"IF(AO330<Instructions!D357,AO330,SUM(AO330:AQ330))","v":0},"--",0,{"$f":"SUM(Table_2[[#This Row],[Column20]],Table_2[[#This Row],[Column19]],Table_2[[#This Row],[Column18]])","v":0},"HEALTH & PHY. EDU.",{"$f":"(M330/Instructions!$C$23)*100","v":0},{"$f":"(P330/Instructions!$C$24)*100","v":0},{"$f":"(S330/Instructions!$C$25)*100","v":0},{"$f":"(V330/Instructions!$C$26)*100","v":0},{"$f":"(Y330/Instructions!$C$27)*100","v":0},{"$f":"(AB330/Instructions!$C$28)*100","v":0},{"$f":"(AF330/Instructions!$C$29)*100","v":0},{"$f":"(AJ330/Instructions!$C$30)*100","v":0},{"$f":"(AN330/Instructions!$C$31)*100","v":0},0,{"$f":"(AS330/Instructions!$C$33)*100","v":{"$error":"#VALUE!"}},"----","E","E","E","E","E","E","E","E","E","E","--","E",null,null,null,null,{"$f":"Table_2[[#This Row],[Column51]]&Table_2[[#This Row],[Column52]]&BU332","v":""}]
[329,null,null,null,null,null,null,null,null,null,null,null,0,null,null,0,null,null,0,null,null,0,null,null,0,null,null,0,null,null,null,0,null,null,null,{"$f":"IF(AG331<Instructions!D360,AG331,SUM(AG331:AI331))","v":0},null,null,null,{"$f":"IF(AK331<Instructions!D359,AK331,SUM(AK331:AM331))","v":0},null,null,null,{"$f":"IF(AO331<Instructions!D358,AO331,SUM(AO331:AQ331))","v":0},"--",0,{"$f":"SUM(Table_2[[#This Row],[Column20]],Table_2[[#This Row],[Column19]],Table_2[[#This Row],[Column18]])","v":0},"HEALTH & PHY. EDU.",{"$f":"(M331/Instructions!$C$23)*100","v":0},{"$f":"(P331/Instructions!$C$24)*100","v":0},{"$f":"(S331/Instructions!$C$25)*100","v":0},{"$f":"(V331/Instructions!$C$26)*100","v":0},{"$f":"(Y331/Instructions!$C$27)*100","v":0},{"$f":"(AB331/Instructions!$C$28)*100","v":0},{"$f":"(AF331/Instructions!$C$29)*100","v":0},{"$f":"(AJ331/Instructions!$C$30)*100","v":0},{"$f":"(AN331/Instructions!$C$31)*100","v":0},0,{"$f":"(AS331/Instructions!$C$33)*100","v":{"$error":"#VALUE!"}},"----","E","E","E","E","E","E","E","E","E","E","--","E",null,null,null,null,{"$f":"Table_2[[#This Row],[Column51]]&Table_2[[#This Row],[Column52]]&BU333","v":""}]
[330,null,null,null,null,null,null,null,null,null,null,null,0,null,null,0,null,null,0,null,null,0,null,null,0,null,null,0,null,null,null,0,null,null,null,{"$f":"IF(AG332<Instructions!D361,AG332,SUM(AG332:AI332))","v":0},null,null,null,{"$f":"IF(AK332<Instructions!D360,AK332,SUM(AK332:AM332))","v":0},null,null,null,{"$f":"IF(AO332<Instructions!D359,AO332,SUM(AO332:AQ332))","v":0},"--",0,{"$f":"SUM(Table_2[[#This Row],[Column20]],Table_2[[#This Row],[Column19]],Table_2[[#This Row],[Column18]])","v":0},"HEALTH & PHY. EDU.",{"$f":"(M332/Instructions!$C$23)*100","v":0},{"$f":"(P332/Instructions!$C$24)*100","v":0},{"$f":"(S332/Instructions!$C$25)*100","v":0},{"$f":"(V332/Instructions!$C$26)*100","v":0},{"$f":"(Y332/Instructions!$C$27)*100","v":0},{"$f":"(AB332/Instructions!$C$28)*100","v":0},{"$f":"(AF332/Instructions!$C$29)*100","v":0},{"$f":"(AJ332/Instructions!$C$30)*100","v":0},{"$f":"(AN332/Instructions!$C$31)*100","v":0},0,{"$f":"(AS332/Instructions!$C$33)*100","v":{"$error":"#VALUE!"}},"----","E","E","E","E","E","E","E","E","E","E","--","E",null,null,null,null,{"$f":"Table_2[[#This Row],[Column51]]&Table_2[[#This Row],[Column52]]&BU334","v":""}]
[331,null,null,null,null,null,null,null,null,null,null,null,0,null,null,0,null,null,0,null,null,0,null,null,0,null,null,0,null,null,null,0,null,null,null,{"$f":"IF(AG333<Instructions!D362,AG333,SUM(AG333:AI333))","v":0},null,null,null,{"$f":"IF(AK333<Instructions!D361,AK333,SUM(AK333:AM333))","v":0},null,null,null,{"$f":"IF(AO333<Instructions!D360,AO333,SUM(AO333:AQ333))","v":0},"--",0,{"$f":"SUM(Table_2[[#This Row],[Column20]],Table_2[[#This Row],[Column19]],Table_2[[#This Row],[Column18]])","v":0},"HEALTH & PHY. EDU.",{"$f":"(M333/Instructions!$C$23)*100","v":0},{"$f":"(P333/Instructions!$C$24)*100","v":0},{"$f":"(S333/Instructions!$C$25)*100","v":0},{"$f":"(V333/Instructions!$C$26)*100","v":0},{"$f":"(Y333/Instructions!$C$27)*100","v":0},{"$f":"(AB333/Instructions!$C$28)*100","v":0},{"$f":"(AF333/Instructions!$C$29)*100","v":0},{"$f":"(AJ333/Instructions!$C$30)*100","v":0},{"$f":"(AN333/Instructions!$C$31)*100","v":0},0,{"$f":"(AS333/Instructions!$C$33)*100","v":{"$error":"#VALUE!"}},"----","E","E","E","E","E","E","E","E","E","E","--","E",null,null,null,null,{"$f":"Table_2[[#This Row],[Column51]]&Table_2[[#This Row],[Column52]]&BU335","v":""}]
[332,null,null,null,null,null,null,null,null,null,null,null,0,null,null,0,null,null,0,null,null,0,null,null,0,null,null,0,null,null,null,0,null,null,null,{"$f":"IF(AG334<Instructions!D363,AG334,SUM(AG334:AI334))","v":0},null,null,null,{"$f":"IF(AK334<Instructions!D362,AK334,SUM(AK334:AM334))","v":0},null,null,null,{"$f":"IF(AO334<Instructions!D361,AO334,SUM(AO334:AQ334))","v":0},"--",0,{"$f":"SUM(Table_2[[#This Row],[Column20]],Table_2[[#This Row],[Column19]],Table_2[[#This Row],[Column18]])","v":0},"HEALTH & PHY. EDU.",{"$f":"(M334/Instructions!$C$23)*100","v":0},{"$f":"(P334/Instructions!$C$24)*100","v":0},{"$f":"(S334/Instructions!$C$25)*100","v":0},{"$f":"(V334/Instructions!$C$26)*100","v":0},{"$f":"(Y334/Instructions!$C$27)*100","v":0},{"$f":"(AB334/Instructions!$C$28)*100","v":0},{"$f":"(AF334/Instructions!$C$29)*100","v":0},{"$f":"(AJ334/Instructions!$C$30)*100","v":0},{"$f":"(AN334/Instructions!$C$31)*100","v":0},0,{"$f":"(AS334/Instructions!$C$33)*100","v":{"$error":"#VALUE!"}},"----","E","E","E","E","E","E","E","E","E","E","--","E",null,null,null,null,{"$f":"Table_2[[#This Row],[Column51]]&Table_2[[#This Row],[Column52]]&BU336","v":""}]
[333,null,null,null,null,null,null,null,null,null,null,null,0,null,null,0,null,null,0,null,null,0,null,null,0,null,null,0,null,null,null,0,null,null,null,{"$f":"IF(AG335<Instructions!D364,AG335,SUM(AG335:AI335))","v":0},null,null,null,{"$f":"IF(AK335<Instructions!D363,AK335,SUM(AK335:AM335))","v":0},null,null,null,{"$f":"IF(AO335<Instructions!D362,AO335,SUM(AO335:AQ335))","v":0},"--",0,{"$f":"SUM(Table_2[[#This Row],[Column20]],Table_2[[#This Row],[Column19]],Table_2[[#This Row],[Column18]])","v":0},"HEALTH & PHY. EDU.",{"$f":"(M335/Instructions!$C$23)*100","v":0},{"$f":"(P335/Instructions!$C$24)*100","v":0},{"$f":"(S335/Instructions!$C$25)*100","v":0},{"$f":"(V335/Instructions!$C$26)*100","v":0},{"$f":"(Y335/Instructions!$C$27)*100","v":0},{"$f":"(AB335/Instructions!$C$28)*100","v":0},{"$f":"(AF335/Instructions!$C$29)*100","v":0},{"$f":"(AJ335/Instructions!$C$30)*100","v":0},{"$f":"(AN335/Instructions!$C$31)*100","v":0},0,{"$f":"(AS335/Instructions!$C$33)*100","v":{"$error":"#VALUE!"}},"----","E","E","E","E","E","E","E","E","E","E","--","E",null,null,null,null,{"$f":"Table_2[[#This Row],[Column51]]&Table_2[[#This Row],[Column52]]&BU337","v":""}]
[334,null,null,null,null,null,null,null,null,null,null,null,0,null,null,0,null,null,0,null,null,0,null,null,0,null,null,0,null,null,null,0,null,null,null,{"$f":"IF(AG336<Instructions!D365,AG336,SUM(AG336:AI336))","v":0},null,null,null,{"$f":"IF(AK336<Instructions!D364,AK336,SUM(AK336:AM336))","v":0},null,null,null,{"$f":"IF(AO336<Instructions!D363,AO336,SUM(AO336:AQ336))","v":0},"--",0,{"$f":"SUM(Table_2[[#This Row],[Column20]],Table_2[[#This Row],[Column19]],Table_2[[#This Row],[Column18]])","v":0},"HEALTH & PHY. EDU.",{"$f":"(M336/Instructions!$C$23)*100","v":0},{"$f":"(P336/Instructions!$C$24)*100","v":0},{"$f":"(S336/Instructions!$C$25)*100","v":0},{"$f":"(V336/Instructions!$C$26)*100","v":0},{"$f":"(Y336/Instructions!$C$27)*100","v":0},{"$f":"(AB336/Instructions!$C$28)*100","v":0},{"$f":"(AF336/Instructions!$C$29)*100","v":0},{"$f":"(AJ336/Instructions!$C$30)*100","v":0},{"$f":"(AN336/Instructions!$C$31)*100","v":0},0,{"$f":"(AS336/Instructions!$C$33)*100","v":{"$error":"#VALUE!"}},"----","E","E","E","E","E","E","E","E","E","E","--","E",null,null,null,null,{"$f":"Table_2[[#This Row],[Column51]]&Table_2[[#This Row],[Column52]]&BU338","v":""}]
[335,null,null,null,null,null,null,null,null,null,null,null,0,null,null,0,null,null,0,null,null,0,null,null,0,null,null,0,null,null,null,0,null,null,null,{"$f":"IF(AG337<Instructions!D366,AG337,SUM(AG337:AI337))","v":0},null,null,null,{"$f":"IF(AK337<Instructions!D365,AK337,SUM(AK337:AM337))","v":0},null,null,null,{"$f":"IF(AO337<Instructions!D364,AO337,SUM(AO337:AQ337))","v":0},"--",0,{"$f":"SUM(Table_2[[#This Row],[Column20]],Table_2[[#This Row],[Column19]],Table_2[[#This Row],[Column18]])","v":0},"HEALTH & PHY. EDU.",{"$f":"(M337/Instructions!$C$23)*100","v":0},{"$f":"(P337/Instructions!$C$24)*100","v":0},{"$f":"(S337/Instructions!$C$25)*100","v":0},{"$f":"(V337/Instructions!$C$26)*100","v":0},{"$f":"(Y337/Instructions!$C$27)*100","v":0},{"$f":"(AB337/Instructions!$C$28)*100","v":0},{"$f":"(AF337/Instructions!$C$29)*100","v":0},{"$f":"(AJ337/Instructions!$C$30)*100","v":0},{"$f":"(AN337/Instructions!$C$31)*100","v":0},0,{"$f":"(AS337/Instructions!$C$33)*100","v":{"$error":"#VALUE!"}},"----","E","E","E","E","E","E","E","E","E","E","--","E",null,null,null,null,{"$f":"Table_2[[#This Row],[Column51]]&Table_2[[#This Row],[Column52]]&BU339","v":""}]
[336,null,null,null,null,null,null,null,null,null,null,null,0,null,null,0,null,null,0,null,null,0,null,null,0,null,null,0,null,null,null,0,null,null,null,{"$f":"IF(AG338<Instructions!D367,AG338,SUM(AG338:AI338))","v":0},null,null,null,{"$f":"IF(AK338<Instructions!D366,AK338,SUM(AK338:AM338))","v":0},null,null,null,{"$f":"IF(AO338<Instructions!D365,AO338,SUM(AO338:AQ338))","v":0},"--",0,{"$f":"SUM(Table_2[[#This Row],[Column20]],Table_2[[#This Row],[Column19]],Table_2[[#This Row],[Column18]])","v":0},"HEALTH & PHY. EDU.",{"$f":"(M338/Instructions!$C$23)*100","v":0},{"$f":"(P338/Instructions!$C$24)*100","v":0},{"$f":"(S338/Instructions!$C$25)*100","v":0},{"$f":"(V338/Instructions!$C$26)*100","v":0},{"$f":"(Y338/Instructions!$C$27)*100","v":0},{"$f":"(AB338/Instructions!$C$28)*100","v":0},{"$f":"(AF338/Instructions!$C$29)*100","v":0},{"$f":"(AJ338/Instructions!$C$30)*100","v":0},{"$f":"(AN338/Instructions!$C$31)*100","v":0},0,{"$f":"(AS338/Instructions!$C$33)*100","v":{"$error":"#VALUE!"}},"----","E","E","E","E","E","E","E","E","E","E","--","E",null,null,null,null,{"$f":"Table_2[[#This Row],[Column51]]&Table_2[[#This Row],[Column52]]&BU340","v":""}]
[337,null,null,null,null,null,null,null,null,null,null,null,0,null,null,0,null,null,0,null,null,0,null,null,0,null,null,0,null,null,null,0,null,null,null,{"$f":"IF(AG339<Instructions!D368,AG339,SUM(AG339:AI339))","v":0},null,null,null,{"$f":"IF(AK339<Instructions!D367,AK339,SUM(AK339:AM339))","v":0},null,null,null,{"$f":"IF(AO339<Instructions!D366,AO339,SUM(AO339:AQ339))","v":0},"--",0,{"$f":"SUM(Table_2[[#This Row],[Column20]],Table_2[[#This Row],[Column19]],Table_2[[#This Row],[Column18]])","v":0},"HEALTH & PHY. EDU.",{"$f":"(M339/Instructions!$C$23)*100","v":0},{"$f":"(P339/Instructions!$C$24)*100","v":0},{"$f":"(S339/Instructions!$C$25)*100","v":0},{"$f":"(V339/Instructions!$C$26)*100","v":0},{"$f":"(Y339/Instructions!$C$27)*100","v":0},{"$f":"(AB339/Instructions!$C$28)*100","v":0},{"$f":"(AF339/Instructions!$C$29)*100","v":0},{"$f":"(AJ339/Instructions!$C$30)*100","v":0},{"$f":"(AN339/Instructions!$C$31)*100","v":0},0,{"$f":"(AS339/Instructions!$C$33)*100","v":{"$error":"#VALUE!"}},"----",{"$f":"IFERROR(IF(AW339>90,\"A+\",IF(AW339>80,\"A\",IF(AW339>70,\"B+\",IF(AW339>60,\"B\",IF(AW339>50,\"C+\",IF(AW339>40,\"C\",IF(AW339>=33,\"D\",\"E\"))))))),\"Abs\")","v":"E"},"E","E","E","E","E","E","E","E","E","--","E",null,null,null,null,{"$f":"Table_2[[#This Row],[Column51]]&Table_2[[#This Row],[Column52]]&BU341","v":""}]
[338,null,null,null,null,null,null,null,null,null,null,null,0,null,null,0,null,null,0,null,null,0,null,null,0,null,null,0,null,null,null,0,null,null,null,{"$f":"IF(AG340<Instructions!D369,AG340,SUM(AG340:AI340))","v":0},null,null,null,{"$f":"IF(AK340<Instructions!D368,AK340,SUM(AK340:AM340))","v":0},null,null,null,{"$f":"IF(AO340<Instructions!D367,AO340,SUM(AO340:AQ340))","v":0},"--",0,{"$f":"SUM(Table_2[[#This Row],[Column20]],Table_2[[#This Row],[Column19]],Table_2[[#This Row],[Column18]])","v":0},"HEALTH & PHY. EDU.",{"$f":"(M340/Instructions!$C$23)*100","v":0},{"$f":"(P340/Instructions!$C$24)*100","v":0},{"$f":"(S340/Instructions!$C$25)*100","v":0},{"$f":"(V340/Instructions!$C$26)*100","v":0},{"$f":"(Y340/Instructions!$C$27)*100","v":0},{"$f":"(AB340/Instructions!$C$28)*100","v":0},{"$f":"(AF340/Instructions!$C$29)*100","v":0},{"$f":"(AJ340/Instructions!$C$30)*100","v":0},{"$f":"(AN340/Instructions!$C$31)*100","v":0},0,{"$f":"(AS340/Instructions!$C$33)*100","v":{"$error":"#VALUE!"}},"----","E","E","E","E","E","E","E","E","E","E","--","E",null,null,null,null,{"$f":"Table_2[[#This Row],[Column51]]&Table_2[[#This Row],[Column52]]&BU342","v":""}]
[339,null,null,null,null,null,null,null,null,null,null,null,0,null,null,0,null,null,0,null,null,0,null,null,0,null,null,0,null,null,null,0,null,null,null,{"$f":"IF(AG341<Instructions!D370,AG341,SUM(AG341:AI341))","v":0},null,null,null,{"$f":"IF(AK341<Instructions!D369,AK341,SUM(AK341:AM341))","v":0},null,null,null,{"$f":"IF(AO341<Instructions!D368,AO341,SUM(AO341:AQ341))","v":0},"--",0,{"$f":"SUM(Table_2[[#This Row],[Column20]],Table_2[[#This Row],[Column19]],Table_2[[#This Row],[Column18]])","v":0},"HEALTH & PHY. EDU.",{"$f":"(M341/Instructions!$C$23)*100","v":0},{"$f":"(P341/Instructions!$C$24)*100","v":0},{"$f":"(S341/Instructions!$C$25)*100","v":0},{"$f":"(V341/Instructions!$C$26)*100","v":0},{"$f":"(Y341/Instructions!$C$27)*100","v":0},{"$f":"(AB341/Instructions!$C$28)*100","v":0},{"$f":"(AF341/Instructions!$C$29)*100","v":0},{"$f":"(AJ341/Instructions!$C$30)*100","v":0},{"$f":"(AN341/Instructions!$C$31)*100","v":0},0,{"$f":"(AS341/Instructions!$C$33)*100","v":{"$error":"#VALUE!"}},"----","E","E","E","E","E","E","E","E","E","E","--","E",null,null,null,null,{"$f":"Table_2[[#This Row],[Column51]]&Table_2[[#This Row],[Column52]]&BU343","v":""}]
[340,null,null,null,null,null,null,null,null,null,null,null,0,null,null,0,null,null,0,null,null,0,null,null,0,null,null,0,null,null,null,0,null,null,null,{"$f":"IF(AG342<Instructions!D371,AG342,SUM(AG342:AI342))","v":0},null,null,null,{"$f":"IF(AK342<Instructions!D370,AK342,SUM(AK342:AM342))","v":0},null,null,null,{"$f":"IF(AO342<Instructions!D369,AO342,SUM(AO342:AQ342))","v":0},"--",0,{"$f":"SUM(Table_2[[#This Row],[Column20]],Table_2[[#This Row],[Column19]],Table_2[[#This Row],[Column18]])","v":0},"HEALTH & PHY. EDU.",{"$f":"(M342/Instructions!$C$23)*100","v":0},{"$f":"(P342/Instructions!$C$24)*100","v":0},{"$f":"(S342/Instructions!$C$25)*100","v":0},{"$f":"(V342/Instructions!$C$26)*100","v":0},{"$f":"(Y342/Instructions!$C$27)*100","v":0},{"$f":"(AB342/Instructions!$C$28)*100","v":0},{"$f":"(AF342/Instructions!$C$29)*100","v":0},{"$f":"(AJ342/Instructions!$C$30)*100","v":0},{"$f":"(AN342/Instructions!$C$31)*100","v":0},0,{"$f":"(AS342/Instructions!$C$33)*100","v":{"$error":"#VALUE!"}},"----","E","E","E","E","E","E","E","E","E","E","--","E",null,null,null,null,{"$f":"Table_2[[#This Row],[Column51]]&Table_2[[#This Row],[Column52]]&BU344","v":""}]
[341,null,null,null,null,null,null,null,null,null,null,null,0,null,null,0,null,null,0,null,null,0,null,null,0,null,null,0,null,null,null,0,null,null,null,{"$f":"IF(AG343<Instructions!D372,AG343,SUM(AG343:AI343))","v":0},null,null,null,{"$f":"IF(AK343<Instructions!D371,AK343,SUM(AK343:AM343))","v":0},null,null,null,{"$f":"IF(AO343<Instructions!D370,AO343,SUM(AO343:AQ343))","v":0},"--",0,{"$f":"SUM(Table_2[[#This Row],[Column20]],Table_2[[#This Row],[Column19]],Table_2[[#This Row],[Column18]])","v":0},"HEALTH & PHY. EDU.",{"$f":"(M343/Instructions!$C$23)*100","v":0},{"$f":"(P343/Instructions!$C$24)*100","v":0},{"$f":"(S343/Instructions!$C$25)*100","v":0},{"$f":"(V343/Instructions!$C$26)*100","v":0},{"$f":"(Y343/Instructions!$C$27)*100","v":0},{"$f":"(AB343/Instructions!$C$28)*100","v":0},{"$f":"(AF343/Instructions!$C$29)*100","v":0},{"$f":"(AJ343/Instructions!$C$30)*100","v":0},{"$f":"(AN343/Instructions!$C$31)*100","v":0},0,{"$f":"(AS343/Instructions!$C$33)*100","v":{"$error":"#VALUE!"}},"----","E","E","E","E","E","E","E","E","E","E","--","E",null,null,null,null,{"$f":"Table_2[[#This Row],[Column51]]&Table_2[[#This Row],[Column52]]&BU345","v":""}]
[342,null,null,null,null,null,null,null,null,null,null,null,0,null,null,0,null,null,0,null,null,0,null,null,0,null,null,0,null,null,null,0,null,null,null,{"$f":"IF(AG344<Instructions!D373,AG344,SUM(AG344:AI344))","v":0},null,null,null,{"$f":"IF(AK344<Instructions!D372,AK344,SUM(AK344:AM344))","v":0},null,null,null,{"$f":"IF(AO344<Instructions!D371,AO344,SUM(AO344:AQ344))","v":0},"--",0,{"$f":"SUM(Table_2[[#This Row],[Column20]],Table_2[[#This Row],[Column19]],Table_2[[#This Row],[Column18]])","v":0},"HEALTH & PHY. EDU.",{"$f":"(M344/Instructions!$C$23)*100","v":0},{"$f":"(P344/Instructions!$C$24)*100","v":0},{"$f":"(S344/Instructions!$C$25)*100","v":0},{"$f":"(V344/Instructions!$C$26)*100","v":0},{"$f":"(Y344/Instructions!$C$27)*100","v":0},{"$f":"(AB344/Instructions!$C$28)*100","v":0},{"$f":"(AF344/Instructions!$C$29)*100","v":0},{"$f":"(AJ344/Instructions!$C$30)*100","v":0},{"$f":"(AN344/Instructions!$C$31)*100","v":0},0,{"$f":"(AS344/Instructions!$C$33)*100","v":{"$error":"#VALUE!"}},"----","E","E","E","E","E","E","E","E","E","E","--","E",null,null,null,null,{"$f":"Table_2[[#This Row],[Column51]]&Table_2[[#This Row],[Column52]]&BU346","v":""}]
[343,null,null,null,null,null,null,null,null,null,null,null,0,null,null,0,null,null,0,null,null,0,null,null,0,null,null,0,null,null,null,0,null,null,null,{"$f":"IF(AG345<Instructions!D374,AG345,SUM(AG345:AI345))","v":0},null,null,null,{"$f":"IF(AK345<Instructions!D373,AK345,SUM(AK345:AM345))","v":0},null,null,null,{"$f":"IF(AO345<Instructions!D372,AO345,SUM(AO345:AQ345))","v":0},"--",0,{"$f":"SUM(Table_2[[#This Row],[Column20]],Table_2[[#This Row],[Column19]],Table_2[[#This Row],[Column18]])","v":0},"HEALTH & PHY. EDU.",{"$f":"(M345/Instructions!$C$23)*100","v":0},{"$f":"(P345/Instructions!$C$24)*100","v":0},{"$f":"(S345/Instructions!$C$25)*100","v":0},{"$f":"(V345/Instructions!$C$26)*100","v":0},{"$f":"(Y345/Instructions!$C$27)*100","v":0},{"$f":"(AB345/Instructions!$C$28)*100","v":0},{"$f":"(AF345/Instructions!$C$29)*100","v":0},{"$f":"(AJ345/Instructions!$C$30)*100","v":0},{"$f":"(AN345/Instructions!$C$31)*100","v":0},0,{"$f":"(AS345/Instructions!$C$33)*100","v":{"$error":"#VALUE!"}},"----","E","E","E","E","E","E","E","E","E","E","--","E",null,null,null,null,{"$f":"Table_2[[#This Row],[Column51]]&Table_2[[#This Row],[Column52]]&BU347","v":""}]
[344,null,null,null,null,null,null,null,null,null,null,null,0,null,null,0,null,null,0,null,null,0,null,null,0,null,null,0,null,null,null,0,null,null,null,{"$f":"IF(AG346<Instructions!D375,AG346,SUM(AG346:AI346))","v":0},null,null,null,{"$f":"IF(AK346<Instructions!D374,AK346,SUM(AK346:AM346))","v":0},null,null,null,{"$f":"IF(AO346<Instructions!D373,AO346,SUM(AO346:AQ346))","v":0},"--",0,{"$f":"SUM(Table_2[[#This Row],[Column20]],Table_2[[#This Row],[Column19]],Table_2[[#This Row],[Column18]])","v":0},"HEALTH & PHY. EDU.",{"$f":"(M346/Instructions!$C$23)*100","v":0},{"$f":"(P346/Instructions!$C$24)*100","v":0},{"$f":"(S346/Instructions!$C$25)*100","v":0},{"$f":"(V346/Instructions!$C$26)*100","v":0},{"$f":"(Y346/Instructions!$C$27)*100","v":0},{"$f":"(AB346/Instructions!$C$28)*100","v":0},{"$f":"(AF346/Instructions!$C$29)*100","v":0},{"$f":"(AJ346/Instructions!$C$30)*100","v":0},{"$f":"(AN346/Instructions!$C$31)*100","v":0},0,{"$f":"(AS346/Instructions!$C$33)*100","v":{"$error":"#VALUE!"}},"----","E","E","E","E","E","E","E","E","E","E","--","E",null,null,null,null,{"$f":"Table_2[[#This Row],[Column51]]&Table_2[[#This Row],[Column52]]&BU348","v":""}]
[345,null,null,null,null,null,null,null,null,null,null,null,0,null,null,0,null,null,0,null,null,0,null,null,0,null,null,0,null,null,null,0,null,null,null,{"$f":"IF(AG347<Instructions!D376,AG347,SUM(AG347:AI347))","v":0},null,null,null,{"$f":"IF(AK347<Instructions!D375,AK347,SUM(AK347:AM347))","v":0},null,null,null,{"$f":"IF(AO347<Instructions!D374,AO347,SUM(AO347:AQ347))","v":0},"--",0,{"$f":"SUM(Table_2[[#This Row],[Column20]],Table_2[[#This Row],[Column19]],Table_2[[#This Row],[Column18]])","v":0},"HEALTH & PHY. EDU.",{"$f":"(M347/Instructions!$C$23)*100","v":0},{"$f":"(P347/Instructions!$C$24)*100","v":0},{"$f":"(S347/Instructions!$C$25)*100","v":0},{"$f":"(V347/Instructions!$C$26)*100","v":0},{"$f":"(Y347/Instructions!$C$27)*100","v":0},{"$f":"(AB347/Instructions!$C$28)*100","v":0},{"$f":"(AF347/Instructions!$C$29)*100","v":0},{"$f":"(AJ347/Instructions!$C$30)*100","v":0},{"$f":"(AN347/Instructions!$C$31)*100","v":0},0,{"$f":"(AS347/Instructions!$C$33)*100","v":{"$error":"#VALUE!"}},"----","E","E","E","E","E","E","E","E","E","E","--","E",null,null,null,null,{"$f":"Table_2[[#This Row],[Column51]]&Table_2[[#This Row],[Column52]]&BU349","v":""}]
[346,null,null,null,null,null,null,null,null,null,null,null,0,null,null,0,null,null,0,null,null,0,null,null,0,null,null,0,null,null,null,0,null,null,null,{"$f":"IF(AG348<Instructions!D377,AG348,SUM(AG348:AI348))","v":0},null,null,null,{"$f":"IF(AK348<Instructions!D376,AK348,SUM(AK348:AM348))","v":0},null,null,null,{"$f":"IF(AO348<Instructions!D375,AO348,SUM(AO348:AQ348))","v":0},"--",0,{"$f":"SUM(Table_2[[#This Row],[Column20]],Table_2[[#This Row],[Column19]],Table_2[[#This Row],[Column18]])","v":0},"HEALTH & PHY. EDU.",{"$f":"(M348/Instructions!$C$23)*100","v":0},{"$f":"(P348/Instructions!$C$24)*100","v":0},{"$f":"(S348/Instructions!$C$25)*100","v":0},{"$f":"(V348/Instructions!$C$26)*100","v":0},{"$f":"(Y348/Instructions!$C$27)*100","v":0},{"$f":"(AB348/Instructions!$C$28)*100","v":0},{"$f":"(AF348/Instructions!$C$29)*100","v":0},{"$f":"(AJ348/Instructions!$C$30)*100","v":0},{"$f":"(AN348/Instructions!$C$31)*100","v":0},0,{"$f":"(AS348/Instructions!$C$33)*100","v":{"$error":"#VALUE!"}},"----","E","E","E","E","E","E","E","E","E","E","--","E",null,null,null,null,{"$f":"Table_2[[#This Row],[Column51]]&Table_2[[#This Row],[Column52]]&BU350","v":""}]
[347,null,null,null,null,null,null,null,null,null,null,null,0,null,null,0,null,null,0,null,null,0,null,null,0,null,null,0,null,null,null,0,null,null,null,{"$f":"IF(AG349<Instructions!D378,AG349,SUM(AG349:AI349))","v":0},null,null,null,{"$f":"IF(AK349<Instructions!D377,AK349,SUM(AK349:AM349))","v":0},null,null,null,{"$f":"IF(AO349<Instructions!D376,AO349,SUM(AO349:AQ349))","v":0},"--",0,{"$f":"SUM(Table_2[[#This Row],[Column20]],Table_2[[#This Row],[Column19]],Table_2[[#This Row],[Column18]])","v":0},"HEALTH & PHY. EDU.",{"$f":"(M349/Instructions!$C$23)*100","v":0},{"$f":"(P349/Instructions!$C$24)*100","v":0},{"$f":"(S349/Instructions!$C$25)*100","v":0},{"$f":"(V349/Instructions!$C$26)*100","v":0},{"$f":"(Y349/Instructions!$C$27)*100","v":0},{"$f":"(AB349/Instructions!$C$28)*100","v":0},{"$f":"(AF349/Instructions!$C$29)*100","v":0},{"$f":"(AJ349/Instructions!$C$30)*100","v":0},{"$f":"(AN349/Instructions!$C$31)*100","v":0},0,{"$f":"(AS349/Instructions!$C$33)*100","v":{"$error":"#VALUE!"}},"----","E","E","E","E","E","E","E","E","E","E","--","E",null,null,null,null,{"$f":"Table_2[[#This Row],[Column51]]&Table_2[[#This Row],[Column52]]&BU351","v":""}]
[348,null,null,null,null,null,null,null,null,null,null,null,0,null,null,0,null,null,0,null,null,0,null,null,0,null,null,0,null,null,null,0,null,null,null,{"$f":"IF(AG350<Instructions!D379,AG350,SUM(AG350:AI350))","v":0},null,null,null,{"$f":"IF(AK350<Instructions!D378,AK350,SUM(AK350:AM350))","v":0},null,null,null,{"$f":"IF(AO350<Instructions!D377,AO350,SUM(AO350:AQ350))","v":0},"--",0,{"$f":"SUM(Table_2[[#This Row],[Column20]],Table_2[[#This Row],[Column19]],Table_2[[#This Row],[Column18]])","v":0},"HEALTH & PHY. EDU.",{"$f":"(M350/Instructions!$C$23)*100","v":0},{"$f":"(P350/Instructions!$C$24)*100","v":0},{"$f":"(S350/Instructions!$C$25)*100","v":0},{"$f":"(V350/Instructions!$C$26)*100","v":0},{"$f":"(Y350/Instructions!$C$27)*100","v":0},{"$f":"(AB350/Instructions!$C$28)*100","v":0},{"$f":"(AF350/Instructions!$C$29)*100","v":0},{"$f":"(AJ350/Instructions!$C$30)*100","v":0},{"$f":"(AN350/Instructions!$C$31)*100","v":0},0,{"$f":"(AS350/Instructions!$C$33)*100","v":{"$error":"#VALUE!"}},"----","E","E","E","E","E","E","E","E","E","E","--","E",null,null,null,null,{"$f":"Table_2[[#This Row],[Column51]]&Table_2[[#This Row],[Column52]]&BU352","v":""}]
[349,null,null,null,null,null,null,null,null,null,null,null,0,null,null,0,null,null,0,null,null,0,null,null,0,null,null,0,null,null,null,0,null,null,null,{"$f":"IF(AG351<Instructions!D380,AG351,SUM(AG351:AI351))","v":0},null,null,null,{"$f":"IF(AK351<Instructions!D379,AK351,SUM(AK351:AM351))","v":0},null,null,null,{"$f":"IF(AO351<Instructions!D378,AO351,SUM(AO351:AQ351))","v":0},"--",0,{"$f":"SUM(Table_2[[#This Row],[Column20]],Table_2[[#This Row],[Column19]],Table_2[[#This Row],[Column18]])","v":0},"HEALTH & PHY. EDU.",{"$f":"(M351/Instructions!$C$23)*100","v":0},{"$f":"(P351/Instructions!$C$24)*100","v":0},{"$f":"(S351/Instructions!$C$25)*100","v":0},{"$f":"(V351/Instructions!$C$26)*100","v":0},{"$f":"(Y351/Instructions!$C$27)*100","v":0},{"$f":"(AB351/Instructions!$C$28)*100","v":0},{"$f":"(AF351/Instructions!$C$29)*100","v":0},{"$f":"(AJ351/Instructions!$C$30)*100","v":0},{"$f":"(AN351/Instructions!$C$31)*100","v":0},0,{"$f":"(AS351/Instructions!$C$33)*100","v":{"$error":"#VALUE!"}},"----","E","E","E","E","E","E","E","E","E","E","--","E",null,null,null,null,{"$f":"Table_2[[#This Row],[Column51]]&Table_2[[#This Row],[Column52]]&BU353","v":""}]
[350,null,null,null,null,null,null,null,null,null,null,null,0,null,null,0,null,null,0,null,null,0,null,null,0,null,null,0,null,null,null,0,null,null,null,{"$f":"IF(AG352<Instructions!D381,AG352,SUM(AG352:AI352))","v":0},null,null,null,{"$f":"IF(AK352<Instructions!D380,AK352,SUM(AK352:AM352))","v":0},null,null,null,{"$f":"IF(AO352<Instructions!D379,AO352,SUM(AO352:AQ352))","v":0},"--",0,{"$f":"SUM(Table_2[[#This Row],[Column20]],Table_2[[#This Row],[Column19]],Table_2[[#This Row],[Column18]])","v":0},"HEALTH & PHY. EDU.",{"$f":"(M352/Instructions!$C$23)*100","v":0},{"$f":"(P352/Instructions!$C$24)*100","v":0},{"$f":"(S352/Instructions!$C$25)*100","v":0},{"$f":"(V352/Instructions!$C$26)*100","v":0},{"$f":"(Y352/Instructions!$C$27)*100","v":0},{"$f":"(AB352/Instructions!$C$28)*100","v":0},{"$f":"(AF352/Instructions!$C$29)*100","v":0},{"$f":"(AJ352/Instructions!$C$30)*100","v":0},{"$f":"(AN352/Instructions!$C$31)*100","v":0},0,{"$f":"(AS352/Instructions!$C$33)*100","v":{"$error":"#VALUE!"}},"----","E","E","E","E","E","E","E","E","E","E","--","E",null,null,null,null,{"$f":"Table_2[[#This Row],[Column51]]&Table_2[[#This Row],[Column52]]&BU354","v":""}]
[351,null,null,null,null,null,null,null,null,null,null,null,0,null,null,0,null,null,0,null,null,0,null,null,0,null,null,0,null,null,null,0,null,null,null,{"$f":"IF(AG353<Instructions!D382,AG353,SUM(AG353:AI353))","v":0},null,null,null,{"$f":"IF(AK353<Instructions!D381,AK353,SUM(AK353:AM353))","v":0},null,null,null,{"$f":"IF(AO353<Instructions!D380,AO353,SUM(AO353:AQ353))","v":0},"--",0,{"$f":"SUM(Table_2[[#This Row],[Column20]],Table_2[[#This Row],[Column19]],Table_2[[#This Row],[Column18]])","v":0},"HEALTH & PHY. EDU.",{"$f":"(M353/Instructions!$C$23)*100","v":0},{"$f":"(P353/Instructions!$C$24)*100","v":0},{"$f":"(S353/Instructions!$C$25)*100","v":0},{"$f":"(V353/Instructions!$C$26)*100","v":0},{"$f":"(Y353/Instructions!$C$27)*100","v":0},{"$f":"(AB353/Instructions!$C$28)*100","v":0},{"$f":"(AF353/Instructions!$C$29)*100","v":0},{"$f":"(AJ353/Instructions!$C$30)*100","v":0},{"$f":"(AN353/Instructions!$C$31)*100","v":0},0,{"$f":"(AS353/Instructions!$C$33)*100","v":{"$error":"#VALUE!"}},"----","E","E","E","E","E","E","E","E","E","E","--","E",null,null,null,null,{"$f":"Table_2[[#This Row],[Column51]]&Table_2[[#This Row],[Column52]]&BU355","v":""}]
[352,null,null,null,null,null,null,null,null,null,null,null,0,null,null,0,null,null,0,null,null,0,null,null,0,null,null,0,null,null,null,0,null,null,null,{"$f":"IF(AG354<Instructions!D383,AG354,SUM(AG354:AI354))","v":0},null,null,null,{"$f":"IF(AK354<Instructions!D382,AK354,SUM(AK354:AM354))","v":0},null,null,null,{"$f":"IF(AO354<Instructions!D381,AO354,SUM(AO354:AQ354))","v":0},"--",0,{"$f":"SUM(Table_2[[#This Row],[Column20]],Table_2[[#This Row],[Column19]],Table_2[[#This Row],[Column18]])","v":0},"HEALTH & PHY. EDU.",{"$f":"(M354/Instructions!$C$23)*100","v":0},{"$f":"(P354/Instructions!$C$24)*100","v":0},{"$f":"(S354/Instructions!$C$25)*100","v":0},{"$f":"(V354/Instructions!$C$26)*100","v":0},{"$f":"(Y354/Instructions!$C$27)*100","v":0},{"$f":"(AB354/Instructions!$C$28)*100","v":0},{"$f":"(AF354/Instructions!$C$29)*100","v":0},{"$f":"(AJ354/Instructions!$C$30)*100","v":0},{"$f":"(AN354/Instructions!$C$31)*100","v":0},0,{"$f":"(AS354/Instructions!$C$33)*100","v":{"$error":"#VALUE!"}},"----","E","E","E","E","E","E","E","E","E","E","--","E",null,null,null,null,{"$f":"Table_2[[#This Row],[Column51]]&Table_2[[#This Row],[Column52]]&BU356","v":""}]
[353,null,null,null,null,null,null,null,null,null,null,null,0,null,null,0,null,null,0,null,null,0,null,null,0,null,null,0,null,null,null,0,null,null,null,{"$f":"IF(AG355<Instructions!D384,AG355,SUM(AG355:AI355))","v":0},null,null,null,{"$f":"IF(AK355<Instructions!D383,AK355,SUM(AK355:AM355))","v":0},null,null,null,{"$f":"IF(AO355<Instructions!D382,AO355,SUM(AO355:AQ355))","v":0},"--",0,{"$f":"SUM(Table_2[[#This Row],[Column20]],Table_2[[#This Row],[Column19]],Table_2[[#This Row],[Column18]])","v":0},"HEALTH & PHY. EDU.",{"$f":"(M355/Instructions!$C$23)*100","v":0},{"$f":"(P355/Instructions!$C$24)*100","v":0},{"$f":"(S355/Instructions!$C$25)*100","v":0},{"$f":"(V355/Instructions!$C$26)*100","v":0},{"$f":"(Y355/Instructions!$C$27)*100","v":0},{"$f":"(AB355/Instructions!$C$28)*100","v":0},{"$f":"(AF355/Instructions!$C$29)*100","v":0},{"$f":"(AJ355/Instructions!$C$30)*100","v":0},{"$f":"(AN355/Instructions!$C$31)*100","v":0},0,{"$f":"(AS355/Instructions!$C$33)*100","v":{"$error":"#VALUE!"}},"----","E","E","E","E","E","E","E","E","E","E","--","E",null,null,null,null,{"$f":"Table_2[[#This Row],[Column51]]&Table_2[[#This Row],[Column52]]&BU357","v":""}]
[354,null,null,null,null,null,null,null,null,null,null,null,0,null,null,0,null,null,0,null,null,0,null,null,0,null,null,0,null,null,null,0,null,null,null,{"$f":"IF(AG356<Instructions!D385,AG356,SUM(AG356:AI356))","v":0},null,null,null,{"$f":"IF(AK356<Instructions!D384,AK356,SUM(AK356:AM356))","v":0},null,null,null,{"$f":"IF(AO356<Instructions!D383,AO356,SUM(AO356:AQ356))","v":0},"--",0,{"$f":"SUM(Table_2[[#This Row],[Column20]],Table_2[[#This Row],[Column19]],Table_2[[#This Row],[Column18]])","v":0},"HEALTH & PHY. EDU.",{"$f":"(M356/Instructions!$C$23)*100","v":0},{"$f":"(P356/Instructions!$C$24)*100","v":0},{"$f":"(S356/Instructions!$C$25)*100","v":0},{"$f":"(V356/Instructions!$C$26)*100","v":0},{"$f":"(Y356/Instructions!$C$27)*100","v":0},{"$f":"(AB356/Instructions!$C$28)*100","v":0},{"$f":"(AF356/Instructions!$C$29)*100","v":0},{"$f":"(AJ356/Instructions!$C$30)*100","v":0},{"$f":"(AN356/Instructions!$C$31)*100","v":0},0,{"$f":"(AS356/Instructions!$C$33)*100","v":{"$error":"#VALUE!"}},"----","E","E","E","E","E","E","E","E","E","E","--","E",null,null,null,null,{"$f":"Table_2[[#This Row],[Column51]]&Table_2[[#This Row],[Column52]]&BU358","v":""}]
[355,null,null,null,null,null,null,null,null,null,null,null,0,null,null,0,null,null,0,null,null,0,null,null,0,null,null,0,null,null,null,0,null,null,null,{"$f":"IF(AG357<Instructions!D386,AG357,SUM(AG357:AI357))","v":0},null,null,null,{"$f":"IF(AK357<Instructions!D385,AK357,SUM(AK357:AM357))","v":0},null,null,null,{"$f":"IF(AO357<Instructions!D384,AO357,SUM(AO357:AQ357))","v":0},"--",0,{"$f":"SUM(Table_2[[#This Row],[Column20]],Table_2[[#This Row],[Column19]],Table_2[[#This Row],[Column18]])","v":0},"HEALTH & PHY. EDU.",{"$f":"(M357/Instructions!$C$23)*100","v":0},{"$f":"(P357/Instructions!$C$24)*100","v":0},{"$f":"(S357/Instructions!$C$25)*100","v":0},{"$f":"(V357/Instructions!$C$26)*100","v":0},{"$f":"(Y357/Instructions!$C$27)*100","v":0},{"$f":"(AB357/Instructions!$C$28)*100","v":0},{"$f":"(AF357/Instructions!$C$29)*100","v":0},{"$f":"(AJ357/Instructions!$C$30)*100","v":0},{"$f":"(AN357/Instructions!$C$31)*100","v":0},0,{"$f":"(AS357/Instructions!$C$33)*100","v":{"$error":"#VALUE!"}},"----","E","E","E","E","E","E","E","E","E","E","--","E",null,null,null,null,{"$f":"Table_2[[#This Row],[Column51]]&Table_2[[#This Row],[Column52]]&BU359","v":""}]
[356,null,null,null,null,null,null,null,null,null,null,null,0,null,null,0,null,null,0,null,null,0,null,null,0,null,null,0,null,null,null,0,null,null,null,{"$f":"IF(AG358<Instructions!D387,AG358,SUM(AG358:AI358))","v":0},null,null,null,{"$f":"IF(AK358<Instructions!D386,AK358,SUM(AK358:AM358))","v":0},null,null,null,{"$f":"IF(AO358<Instructions!D385,AO358,SUM(AO358:AQ358))","v":0},"--",0,{"$f":"SUM(Table_2[[#This Row],[Column20]],Table_2[[#This Row],[Column19]],Table_2[[#This Row],[Column18]])","v":0},"HEALTH & PHY. EDU.",{"$f":"(M358/Instructions!$C$23)*100","v":0},{"$f":"(P358/Instructions!$C$24)*100","v":0},{"$f":"(S358/Instructions!$C$25)*100","v":0},{"$f":"(V358/Instructions!$C$26)*100","v":0},{"$f":"(Y358/Instructions!$C$27)*100","v":0},{"$f":"(AB358/Instructions!$C$28)*100","v":0},{"$f":"(AF358/Instructions!$C$29)*100","v":0},{"$f":"(AJ358/Instructions!$C$30)*100","v":0},{"$f":"(AN358/Instructions!$C$31)*100","v":0},0,{"$f":"(AS358/Instructions!$C$33)*100","v":{"$error":"#VALUE!"}},"----","E","E","E","E","E","E","E","E","E","E","--","E",null,null,null,null,{"$f":"Table_2[[#This Row],[Column51]]&Table_2[[#This Row],[Column52]]&BU360","v":""}]
[357,null,null,null,null,null,null,null,null,null,null,null,0,null,null,0,null,null,0,null,null,0,null,null,0,null,null,0,null,null,null,0,null,null,null,{"$f":"IF(AG359<Instructions!D388,AG359,SUM(AG359:AI359))","v":0},null,null,null,{"$f":"IF(AK359<Instructions!D387,AK359,SUM(AK359:AM359))","v":0},null,null,null,{"$f":"IF(AO359<Instructions!D386,AO359,SUM(AO359:AQ359))","v":0},"--",0,{"$f":"SUM(Table_2[[#This Row],[Column20]],Table_2[[#This Row],[Column19]],Table_2[[#This Row],[Column18]])","v":0},"HEALTH & PHY. EDU.",{"$f":"(M359/Instructions!$C$23)*100","v":0},{"$f":"(P359/Instructions!$C$24)*100","v":0},{"$f":"(S359/Instructions!$C$25)*100","v":0},{"$f":"(V359/Instructions!$C$26)*100","v":0},{"$f":"(Y359/Instructions!$C$27)*100","v":0},{"$f":"(AB359/Instructions!$C$28)*100","v":0},{"$f":"(AF359/Instructions!$C$29)*100","v":0},{"$f":"(AJ359/Instructions!$C$30)*100","v":0},{"$f":"(AN359/Instructions!$C$31)*100","v":0},0,{"$f":"(AS359/Instructions!$C$33)*100","v":{"$error":"#VALUE!"}},"----","E","E","E","E","E","E","E","E","E","E","--","E",null,null,null,null,{"$f":"Table_2[[#This Row],[Column51]]&Table_2[[#This Row],[Column52]]&BU361","v":""}]
[358,null,null,null,null,null,null,null,null,null,null,null,0,null,null,0,null,null,0,null,null,0,null,null,0,null,null,0,null,null,null,0,null,null,null,{"$f":"IF(AG360<Instructions!D389,AG360,SUM(AG360:AI360))","v":0},null,null,null,{"$f":"IF(AK360<Instructions!D388,AK360,SUM(AK360:AM360))","v":0},null,null,null,{"$f":"IF(AO360<Instructions!D387,AO360,SUM(AO360:AQ360))","v":0},"--",0,{"$f":"SUM(Table_2[[#This Row],[Column20]],Table_2[[#This Row],[Column19]],Table_2[[#This Row],[Column18]])","v":0},"HEALTH & PHY. EDU.",{"$f":"(M360/Instructions!$C$23)*100","v":0},{"$f":"(P360/Instructions!$C$24)*100","v":0},{"$f":"(S360/Instructions!$C$25)*100","v":0},{"$f":"(V360/Instructions!$C$26)*100","v":0},{"$f":"(Y360/Instructions!$C$27)*100","v":0},{"$f":"(AB360/Instructions!$C$28)*100","v":0},{"$f":"(AF360/Instructions!$C$29)*100","v":0},{"$f":"(AJ360/Instructions!$C$30)*100","v":0},{"$f":"(AN360/Instructions!$C$31)*100","v":0},0,{"$f":"(AS360/Instructions!$C$33)*100","v":{"$error":"#VALUE!"}},"----","E","E","E","E","E","E","E","E","E","E","--","E",null,null,null,null,{"$f":"Table_2[[#This Row],[Column51]]&Table_2[[#This Row],[Column52]]&BU362","v":""}]
[359,null,null,null,null,null,null,null,null,null,null,null,0,null,null,0,null,null,0,null,null,0,null,null,0,null,null,0,null,null,null,0,null,null,null,{"$f":"IF(AG361<Instructions!D390,AG361,SUM(AG361:AI361))","v":0},null,null,null,{"$f":"IF(AK361<Instructions!D389,AK361,SUM(AK361:AM361))","v":0},null,null,null,{"$f":"IF(AO361<Instructions!D388,AO361,SUM(AO361:AQ361))","v":0},"--",0,{"$f":"SUM(Table_2[[#This Row],[Column20]],Table_2[[#This Row],[Column19]],Table_2[[#This Row],[Column18]])","v":0},"HEALTH & PHY. EDU.",{"$f":"(M361/Instructions!$C$23)*100","v":0},{"$f":"(P361/Instructions!$C$24)*100","v":0},{"$f":"(S361/Instructions!$C$25)*100","v":0},{"$f":"(V361/Instructions!$C$26)*100","v":0},{"$f":"(Y361/Instructions!$C$27)*100","v":0},{"$f":"(AB361/Instructions!$C$28)*100","v":0},{"$f":"(AF361/Instructions!$C$29)*100","v":0},{"$f":"(AJ361/Instructions!$C$30)*100","v":0},{"$f":"(AN361/Instructions!$C$31)*100","v":0},0,{"$f":"(AS361/Instructions!$C$33)*100","v":{"$error":"#VALUE!"}},"----","E","E","E","E","E","E","E","E","E","E","--","E",null,null,null,null,{"$f":"Table_2[[#This Row],[Column51]]&Table_2[[#This Row],[Column52]]&BU363","v":""}]
[360,null,null,null,null,null,null,null,null,null,null,null,0,null,null,0,null,null,0,null,null,0,null,null,0,null,null,0,null,null,null,0,null,null,null,{"$f":"IF(AG362<Instructions!D391,AG362,SUM(AG362:AI362))","v":0},null,null,null,{"$f":"IF(AK362<Instructions!D390,AK362,SUM(AK362:AM362))","v":0},null,null,null,{"$f":"IF(AO362<Instructions!D389,AO362,SUM(AO362:AQ362))","v":0},"--",0,{"$f":"SUM(Table_2[[#This Row],[Column20]],Table_2[[#This Row],[Column19]],Table_2[[#This Row],[Column18]])","v":0},"HEALTH & PHY. EDU.",{"$f":"(M362/Instructions!$C$23)*100","v":0},{"$f":"(P362/Instructions!$C$24)*100","v":0},{"$f":"(S362/Instructions!$C$25)*100","v":0},{"$f":"(V362/Instructions!$C$26)*100","v":0},{"$f":"(Y362/Instructions!$C$27)*100","v":0},{"$f":"(AB362/Instructions!$C$28)*100","v":0},{"$f":"(AF362/Instructions!$C$29)*100","v":0},{"$f":"(AJ362/Instructions!$C$30)*100","v":0},{"$f":"(AN362/Instructions!$C$31)*100","v":0},0,{"$f":"(AS362/Instructions!$C$33)*100","v":{"$error":"#VALUE!"}},"----","E","E","E","E","E","E","E","E","E","E","--","E",null,null,null,null,{"$f":"Table_2[[#This Row],[Column51]]&Table_2[[#This Row],[Column52]]&BU364","v":""}]
[361,null,null,null,null,null,null,null,null,null,null,null,0,null,null,0,null,null,0,null,null,0,null,null,0,null,null,0,null,null,null,0,null,null,null,{"$f":"IF(AG363<Instructions!D392,AG363,SUM(AG363:AI363))","v":0},null,null,null,{"$f":"IF(AK363<Instructions!D391,AK363,SUM(AK363:AM363))","v":0},null,null,null,{"$f":"IF(AO363<Instructions!D390,AO363,SUM(AO363:AQ363))","v":0},"--",0,{"$f":"SUM(Table_2[[#This Row],[Column20]],Table_2[[#This Row],[Column19]],Table_2[[#This Row],[Column18]])","v":0},"HEALTH & PHY. EDU.",{"$f":"(M363/Instructions!$C$23)*100","v":0},{"$f":"(P363/Instructions!$C$24)*100","v":0},{"$f":"(S363/Instructions!$C$25)*100","v":0},{"$f":"(V363/Instructions!$C$26)*100","v":0},{"$f":"(Y363/Instructions!$C$27)*100","v":0},{"$f":"(AB363/Instructions!$C$28)*100","v":0},{"$f":"(AF363/Instructions!$C$29)*100","v":0},{"$f":"(AJ363/Instructions!$C$30)*100","v":0},{"$f":"(AN363/Instructions!$C$31)*100","v":0},0,{"$f":"(AS363/Instructions!$C$33)*100","v":{"$error":"#VALUE!"}},"----","E","E","E","E","E","E","E","E","E","E","--","E",null,null,null,null,{"$f":"Table_2[[#This Row],[Column51]]&Table_2[[#This Row],[Column52]]&BU365","v":""}]
[362,null,null,null,null,null,null,null,null,null,null,null,0,null,null,0,null,null,0,null,null,0,null,null,0,null,null,0,null,null,null,0,null,null,null,{"$f":"IF(AG364<Instructions!D393,AG364,SUM(AG364:AI364))","v":0},null,null,null,{"$f":"IF(AK364<Instructions!D392,AK364,SUM(AK364:AM364))","v":0},null,null,null,{"$f":"IF(AO364<Instructions!D391,AO364,SUM(AO364:AQ364))","v":0},"--",0,{"$f":"SUM(Table_2[[#This Row],[Column20]],Table_2[[#This Row],[Column19]],Table_2[[#This Row],[Column18]])","v":0},"HEALTH & PHY. EDU.",{"$f":"(M364/Instructions!$C$23)*100","v":0},{"$f":"(P364/Instructions!$C$24)*100","v":0},{"$f":"(S364/Instructions!$C$25)*100","v":0},{"$f":"(V364/Instructions!$C$26)*100","v":0},{"$f":"(Y364/Instructions!$C$27)*100","v":0},{"$f":"(AB364/Instructions!$C$28)*100","v":0},{"$f":"(AF364/Instructions!$C$29)*100","v":0},{"$f":"(AJ364/Instructions!$C$30)*100","v":0},{"$f":"(AN364/Instructions!$C$31)*100","v":0},0,{"$f":"(AS364/Instructions!$C$33)*100","v":{"$error":"#VALUE!"}},"----","E","E","E","E","E","E","E","E","E","E","--","E",null,null,null,null,{"$f":"Table_2[[#This Row],[Column51]]&Table_2[[#This Row],[Column52]]&BU366","v":""}]
[363,null,null,null,null,null,null,null,null,null,null,null,0,null,null,0,null,null,0,null,null,0,null,null,0,null,null,0,null,null,null,0,null,null,null,{"$f":"IF(AG365<Instructions!D394,AG365,SUM(AG365:AI365))","v":0},null,null,null,{"$f":"IF(AK365<Instructions!D393,AK365,SUM(AK365:AM365))","v":0},null,null,null,{"$f":"IF(AO365<Instructions!D392,AO365,SUM(AO365:AQ365))","v":0},"--",0,{"$f":"SUM(Table_2[[#This Row],[Column20]],Table_2[[#This Row],[Column19]],Table_2[[#This Row],[Column18]])","v":0},"HEALTH & PHY. EDU.",{"$f":"(M365/Instructions!$C$23)*100","v":0},{"$f":"(P365/Instructions!$C$24)*100","v":0},{"$f":"(S365/Instructions!$C$25)*100","v":0},{"$f":"(V365/Instructions!$C$26)*100","v":0},{"$f":"(Y365/Instructions!$C$27)*100","v":0},{"$f":"(AB365/Instructions!$C$28)*100","v":0},{"$f":"(AF365/Instructions!$C$29)*100","v":0},{"$f":"(AJ365/Instructions!$C$30)*100","v":0},{"$f":"(AN365/Instructions!$C$31)*100","v":0},0,{"$f":"(AS365/Instructions!$C$33)*100","v":{"$error":"#VALUE!"}},"----","E","E","E","E","E","E","E","E","E","E","--","E",null,null,null,null,{"$f":"Table_2[[#This Row],[Column51]]&Table_2[[#This Row],[Column52]]&BU367","v":""}]
[364,null,null,null,null,null,null,null,null,null,null,null,0,null,null,0,null,null,0,null,null,0,null,null,0,null,null,0,null,null,null,0,null,null,null,{"$f":"IF(AG366<Instructions!D395,AG366,SUM(AG366:AI366))","v":0},null,null,null,{"$f":"IF(AK366<Instructions!D394,AK366,SUM(AK366:AM366))","v":0},null,null,null,{"$f":"IF(AO366<Instructions!D393,AO366,SUM(AO366:AQ366))","v":0},"--",0,{"$f":"SUM(Table_2[[#This Row],[Column20]],Table_2[[#This Row],[Column19]],Table_2[[#This Row],[Column18]])","v":0},"HEALTH & PHY. EDU.",{"$f":"(M366/Instructions!$C$23)*100","v":0},{"$f":"(P366/Instructions!$C$24)*100","v":0},{"$f":"(S366/Instructions!$C$25)*100","v":0},{"$f":"(V366/Instructions!$C$26)*100","v":0},{"$f":"(Y366/Instructions!$C$27)*100","v":0},{"$f":"(AB366/Instructions!$C$28)*100","v":0},{"$f":"(AF366/Instructions!$C$29)*100","v":0},{"$f":"(AJ366/Instructions!$C$30)*100","v":0},{"$f":"(AN366/Instructions!$C$31)*100","v":0},0,{"$f":"(AS366/Instructions!$C$33)*100","v":{"$error":"#VALUE!"}},"----","E","E","E","E","E","E","E","E","E","E","--","E",null,null,null,null,{"$f":"Table_2[[#This Row],[Column51]]&Table_2[[#This Row],[Column52]]&BU368","v":""}]
[365,null,null,null,null,null,null,null,null,null,null,null,0,null,null,0,null,null,0,null,null,0,null,null,0,null,null,0,null,null,null,0,null,null,null,{"$f":"IF(AG367<Instructions!D396,AG367,SUM(AG367:AI367))","v":0},null,null,null,{"$f":"IF(AK367<Instructions!D395,AK367,SUM(AK367:AM367))","v":0},null,null,null,{"$f":"IF(AO367<Instructions!D394,AO367,SUM(AO367:AQ367))","v":0},"--",0,{"$f":"SUM(Table_2[[#This Row],[Column20]],Table_2[[#This Row],[Column19]],Table_2[[#This Row],[Column18]])","v":0},"HEALTH & PHY. EDU.",{"$f":"(M367/Instructions!$C$23)*100","v":0},{"$f":"(P367/Instructions!$C$24)*100","v":0},{"$f":"(S367/Instructions!$C$25)*100","v":0},{"$f":"(V367/Instructions!$C$26)*100","v":0},{"$f":"(Y367/Instructions!$C$27)*100","v":0},{"$f":"(AB367/Instructions!$C$28)*100","v":0},{"$f":"(AF367/Instructions!$C$29)*100","v":0},{"$f":"(AJ367/Instructions!$C$30)*100","v":0},{"$f":"(AN367/Instructions!$C$31)*100","v":0},0,{"$f":"(AS367/Instructions!$C$33)*100","v":{"$error":"#VALUE!"}},"----","E","E","E","E","E","E","E","E","E","E","--","E",null,null,null,null,{"$f":"Table_2[[#This Row],[Column51]]&Table_2[[#This Row],[Column52]]&BU369","v":""}]
[366,null,null,null,null,null,null,null,null,null,null,null,0,null,null,0,null,null,0,null,null,0,null,null,0,null,null,0,null,null,null,0,null,null,null,{"$f":"IF(AG368<Instructions!D397,AG368,SUM(AG368:AI368))","v":0},null,null,null,{"$f":"IF(AK368<Instructions!D396,AK368,SUM(AK368:AM368))","v":0},null,null,null,{"$f":"IF(AO368<Instructions!D395,AO368,SUM(AO368:AQ368))","v":0},"--",0,{"$f":"SUM(Table_2[[#This Row],[Column20]],Table_2[[#This Row],[Column19]],Table_2[[#This Row],[Column18]])","v":0},"HEALTH & PHY. EDU.",{"$f":"(M368/Instructions!$C$23)*100","v":0},{"$f":"(P368/Instructions!$C$24)*100","v":0},{"$f":"(S368/Instructions!$C$25)*100","v":0},{"$f":"(V368/Instructions!$C$26)*100","v":0},{"$f":"(Y368/Instructions!$C$27)*100","v":0},{"$f":"(AB368/Instructions!$C$28)*100","v":0},{"$f":"(AF368/Instructions!$C$29)*100","v":0},{"$f":"(AJ368/Instructions!$C$30)*100","v":0},{"$f":"(AN368/Instructions!$C$31)*100","v":0},0,{"$f":"(AS368/Instructions!$C$33)*100","v":{"$error":"#VALUE!"}},"----","E","E","E","E","E","E","E","E","E","E","--","E",null,null,null,null,{"$f":"Table_2[[#This Row],[Column51]]&Table_2[[#This Row],[Column52]]&BU370","v":""}]
[367,null,null,null,null,null,null,null,null,null,null,null,0,null,null,0,null,null,0,null,null,0,null,null,0,null,null,0,null,null,null,0,null,null,null,{"$f":"IF(AG369<Instructions!D398,AG369,SUM(AG369:AI369))","v":0},null,null,null,{"$f":"IF(AK369<Instructions!D397,AK369,SUM(AK369:AM369))","v":0},null,null,null,{"$f":"IF(AO369<Instructions!D396,AO369,SUM(AO369:AQ369))","v":0},"--",0,{"$f":"SUM(Table_2[[#This Row],[Column20]],Table_2[[#This Row],[Column19]],Table_2[[#This Row],[Column18]])","v":0},"HEALTH & PHY. EDU.",{"$f":"(M369/Instructions!$C$23)*100","v":0},{"$f":"(P369/Instructions!$C$24)*100","v":0},{"$f":"(S369/Instructions!$C$25)*100","v":0},{"$f":"(V369/Instructions!$C$26)*100","v":0},{"$f":"(Y369/Instructions!$C$27)*100","v":0},{"$f":"(AB369/Instructions!$C$28)*100","v":0},{"$f":"(AF369/Instructions!$C$29)*100","v":0},{"$f":"(AJ369/Instructions!$C$30)*100","v":0},{"$f":"(AN369/Instructions!$C$31)*100","v":0},0,{"$f":"(AS369/Instructions!$C$33)*100","v":{"$error":"#VALUE!"}},"----","E","E","E","E","E","E","E","E","E","E","--","E",null,null,null,null,{"$f":"Table_2[[#This Row],[Column51]]&Table_2[[#This Row],[Column52]]&BU371","v":""}]
[368,null,null,null,null,null,null,null,null,null,null,null,0,null,null,0,null,null,0,null,null,0,null,null,0,null,null,0,null,null,null,0,null,null,null,{"$f":"IF(AG370<Instructions!D399,AG370,SUM(AG370:AI370))","v":0},null,null,null,{"$f":"IF(AK370<Instructions!D398,AK370,SUM(AK370:AM370))","v":0},null,null,null,{"$f":"IF(AO370<Instructions!D397,AO370,SUM(AO370:AQ370))","v":0},"--",0,{"$f":"SUM(Table_2[[#This Row],[Column20]],Table_2[[#This Row],[Column19]],Table_2[[#This Row],[Column18]])","v":0},"HEALTH & PHY. EDU.",{"$f":"(M370/Instructions!$C$23)*100","v":0},{"$f":"(P370/Instructions!$C$24)*100","v":0},{"$f":"(S370/Instructions!$C$25)*100","v":0},{"$f":"(V370/Instructions!$C$26)*100","v":0},{"$f":"(Y370/Instructions!$C$27)*100","v":0},{"$f":"(AB370/Instructions!$C$28)*100","v":0},{"$f":"(AF370/Instructions!$C$29)*100","v":0},{"$f":"(AJ370/Instructions!$C$30)*100","v":0},{"$f":"(AN370/Instructions!$C$31)*100","v":0},0,{"$f":"(AS370/Instructions!$C$33)*100","v":{"$error":"#VALUE!"}},"----","E","E","E","E","E","E","E","E","E","E","--","E",null,null,null,null,{"$f":"Table_2[[#This Row],[Column51]]&Table_2[[#This Row],[Column52]]&BU372","v":""}]
[369,null,null,null,null,null,null,null,null,null,null,null,0,null,null,0,null,null,0,null,null,0,null,null,0,null,null,0,null,null,null,0,null,null,null,{"$f":"IF(AG371<Instructions!D400,AG371,SUM(AG371:AI371))","v":0},null,null,null,{"$f":"IF(AK371<Instructions!D399,AK371,SUM(AK371:AM371))","v":0},null,null,null,{"$f":"IF(AO371<Instructions!D398,AO371,SUM(AO371:AQ371))","v":0},"--",0,{"$f":"SUM(Table_2[[#This Row],[Column20]],Table_2[[#This Row],[Column19]],Table_2[[#This Row],[Column18]])","v":0},"HEALTH & PHY. EDU.",{"$f":"(M371/Instructions!$C$23)*100","v":0},{"$f":"(P371/Instructions!$C$24)*100","v":0},{"$f":"(S371/Instructions!$C$25)*100","v":0},{"$f":"(V371/Instructions!$C$26)*100","v":0},{"$f":"(Y371/Instructions!$C$27)*100","v":0},{"$f":"(AB371/Instructions!$C$28)*100","v":0},{"$f":"(AF371/Instructions!$C$29)*100","v":0},{"$f":"(AJ371/Instructions!$C$30)*100","v":0},{"$f":"(AN371/Instructions!$C$31)*100","v":0},0,{"$f":"(AS371/Instructions!$C$33)*100","v":{"$error":"#VALUE!"}},"----","E","E","E","E","E","E","E","E","E","E","--","E",null,null,null,null,{"$f":"Table_2[[#This Row],[Column51]]&Table_2[[#This Row],[Column52]]&BU373","v":""}]
[370,null,null,null,null,null,null,null,null,null,null,null,0,null,null,0,null,null,0,null,null,0,null,null,0,null,null,0,null,null,null,0,null,null,null,{"$f":"IF(AG372<Instructions!D401,AG372,SUM(AG372:AI372))","v":0},null,null,null,{"$f":"IF(AK372<Instructions!D400,AK372,SUM(AK372:AM372))","v":0},null,null,null,{"$f":"IF(AO372<Instructions!D399,AO372,SUM(AO372:AQ372))","v":0},"--",0,{"$f":"SUM(Table_2[[#This Row],[Column20]],Table_2[[#This Row],[Column19]],Table_2[[#This Row],[Column18]])","v":0},"HEALTH & PHY. EDU.",{"$f":"(M372/Instructions!$C$23)*100","v":0},{"$f":"(P372/Instructions!$C$24)*100","v":0},{"$f":"(S372/Instructions!$C$25)*100","v":0},{"$f":"(V372/Instructions!$C$26)*100","v":0},{"$f":"(Y372/Instructions!$C$27)*100","v":0},{"$f":"(AB372/Instructions!$C$28)*100","v":0},{"$f":"(AF372/Instructions!$C$29)*100","v":0},{"$f":"(AJ372/Instructions!$C$30)*100","v":0},{"$f":"(AN372/Instructions!$C$31)*100","v":0},0,{"$f":"(AS372/Instructions!$C$33)*100","v":{"$error":"#VALUE!"}},"----","E","E","E","E","E","E","E","E","E","E","--","E",null,null,null,null,{"$f":"Table_2[[#This Row],[Column51]]&Table_2[[#This Row],[Column52]]&BU374","v":""}]
[371,null,null,null,null,null,null,null,null,null,null,null,0,null,null,0,null,null,0,null,null,0,null,null,0,null,null,0,null,null,null,0,null,null,null,{"$f":"IF(AG373<Instructions!D402,AG373,SUM(AG373:AI373))","v":0},null,null,null,{"$f":"IF(AK373<Instructions!D401,AK373,SUM(AK373:AM373))","v":0},null,null,null,{"$f":"IF(AO373<Instructions!D400,AO373,SUM(AO373:AQ373))","v":0},"--",0,{"$f":"SUM(Table_2[[#This Row],[Column20]],Table_2[[#This Row],[Column19]],Table_2[[#This Row],[Column18]])","v":0},"HEALTH & PHY. EDU.",{"$f":"(M373/Instructions!$C$23)*100","v":0},{"$f":"(P373/Instructions!$C$24)*100","v":0},{"$f":"(S373/Instructions!$C$25)*100","v":0},{"$f":"(V373/Instructions!$C$26)*100","v":0},{"$f":"(Y373/Instructions!$C$27)*100","v":0},{"$f":"(AB373/Instructions!$C$28)*100","v":0},{"$f":"(AF373/Instructions!$C$29)*100","v":0},{"$f":"(AJ373/Instructions!$C$30)*100","v":0},{"$f":"(AN373/Instructions!$C$31)*100","v":0},0,{"$f":"(AS373/Instructions!$C$33)*100","v":{"$error":"#VALUE!"}},"----","E","E",{"$f":"IFERROR(IF(AY373>90,\"A+\",IF(AY373>80,\"A\",IF(AY373>70,\"B+\",IF(AY373>60,\"B\",IF(AY373>50,\"C+\",IF(AY373>40,\"C\",IF(AY373>=33,\"D\",\"E\"))))))),\"Abs\")","v":"E"},{"$f":"IFERROR(IF(AZ373>90,\"A+\",IF(AZ373>80,\"A\",IF(AZ373>70,\"B+\",IF(AZ373>60,\"B\",IF(AZ373>50,\"C+\",IF(AZ373>40,\"C\",IF(AZ373>=33,\"D\",\"E\"))))))),\"Abs\")","v":"E"},{"$f":"IFERROR(IF(BA373>90,\"A+\",IF(BA373>80,\"A\",IF(BA373>70,\"B+\",IF(BA373>60,\"B\",IF(BA373>50,\"C+\",IF(BA373>40,\"C\",IF(BA373>=33,\"D\",\"E\"))))))),\"Abs\")","v":"E"},{"$f":"IFERROR(IF(BB373>90,\"A+\",IF(BB373>80,\"A\",IF(BB373>70,\"B+\",IF(BB373>60,\"B\",IF(BB373>50,\"C+\",IF(BB373>40,\"C\",IF(BB373>=33,\"D\",\"E\"))))))),\"Abs\")","v":"E"},{"$f":"IFERROR(IF(BC373>90,\"A+\",IF(BC373>80,\"A\",IF(BC373>70,\"B+\",IF(BC373>60,\"B\",IF(BC373>50,\"C+\",IF(BC373>40,\"C\",IF(BC373>=33,\"D\",\"E\"))))))),\"Abs\")","v":"E"},{"$f":"IFERROR(IF(BD373>90,\"A+\",IF(BD373>80,\"A\",IF(BD373>70,\"B+\",IF(BD373>60,\"B\",IF(BD373>50,\"C+\",IF(BD373>40,\"C\",IF(BD373>=33,\"D\",\"E\"))))))),\"Abs\")","v":"E"},{"$f":"IFERROR(IF(BE373>90,\"A+\",IF(BE373>80,\"A\",IF(BE373>70,\"B+\",IF(BE373>60,\"B\",IF(BE373>50,\"C+\",IF(BE373>40,\"C\",IF(BE373>=33,\"D\",\"E\"))))))),\"Abs\")","v":"E"},{"$f":"IFERROR(IF(BF373>90,\"A+\",IF(BF373>80,\"A\",IF(BF373>70,\"B+\",IF(BF373>60,\"B\",IF(BF373>50,\"C+\",IF(BF373>40,\"C\",IF(BF373>=33,\"D\",\"E\"))))))),\"Abs\")","v":"E"},"--","E",null,null,null,null,{"$f":"Table_2[[#This Row],[Column51]]&Table_2[[#This Row],[Column52]]&BU375","v":""}]
[372,null,null,null,null,null,null,null,null,null,null,null,0,null,null,0,null,null,0,null,null,0,null,null,0,null,null,0,null,null,null,0,null,null,null,{"$f":"IF(AG374<Instructions!D403,AG374,SUM(AG374:AI374))","v":0},null,null,null,{"$f":"IF(AK374<Instructions!D402,AK374,SUM(AK374:AM374))","v":0},null,null,null,{"$f":"IF(AO374<Instructions!D401,AO374,SUM(AO374:AQ374))","v":0},"--",0,{"$f":"SUM(Table_2[[#This Row],[Column20]],Table_2[[#This Row],[Column19]],Table_2[[#This Row],[Column18]])","v":0},"HEALTH & PHY. EDU.",{"$f":"(M374/Instructions!$C$23)*100","v":0},{"$f":"(P374/Instructions!$C$24)*100","v":0},{"$f":"(S374/Instructions!$C$25)*100","v":0},{"$f":"(V374/Instructions!$C$26)*100","v":0},{"$f":"(Y374/Instructions!$C$27)*100","v":0},{"$f":"(AB374/Instructions!$C$28)*100","v":0},{"$f":"(AF374/Instructions!$C$29)*100","v":0},{"$f":"(AJ374/Instructions!$C$30)*100","v":0},{"$f":"(AN374/Instructions!$C$31)*100","v":0},0,{"$f":"(AS374/Instructions!$C$33)*100","v":{"$error":"#VALUE!"}},"----","E","E","E","E","E","E","E","E","E","E","--","E",null,null,null,null,{"$f":"Table_2[[#This Row],[Column51]]&Table_2[[#This Row],[Column52]]&BU376","v":""}]
[373,null,null,null,null,null,null,null,null,null,null,null,0,null,null,0,null,null,0,null,null,0,null,null,0,null,null,0,null,null,null,0,null,null,null,{"$f":"IF(AG375<Instructions!D404,AG375,SUM(AG375:AI375))","v":0},null,null,null,{"$f":"IF(AK375<Instructions!D403,AK375,SUM(AK375:AM375))","v":0},null,null,null,{"$f":"IF(AO375<Instructions!D402,AO375,SUM(AO375:AQ375))","v":0},"--",0,{"$f":"SUM(Table_2[[#This Row],[Column20]],Table_2[[#This Row],[Column19]],Table_2[[#This Row],[Column18]])","v":0},"HEALTH & PHY. EDU.",{"$f":"(M375/Instructions!$C$23)*100","v":0},{"$f":"(P375/Instructions!$C$24)*100","v":0},{"$f":"(S375/Instructions!$C$25)*100","v":0},{"$f":"(V375/Instructions!$C$26)*100","v":0},{"$f":"(Y375/Instructions!$C$27)*100","v":0},{"$f":"(AB375/Instructions!$C$28)*100","v":0},{"$f":"(AF375/Instructions!$C$29)*100","v":0},{"$f":"(AJ375/Instructions!$C$30)*100","v":0},{"$f":"(AN375/Instructions!$C$31)*100","v":0},0,{"$f":"(AS375/Instructions!$C$33)*100","v":{"$error":"#VALUE!"}},"----","E","E","E","E","E","E","E","E","E","E","--","E",null,null,null,null,{"$f":"Table_2[[#This Row],[Column51]]&Table_2[[#This Row],[Column52]]&BU377","v":""}]
[374,null,null,null,null,null,null,null,null,null,null,null,0,null,null,0,null,null,0,null,null,0,null,null,0,null,null,0,null,null,null,0,null,null,null,{"$f":"IF(AG376<Instructions!D405,AG376,SUM(AG376:AI376))","v":0},null,null,null,{"$f":"IF(AK376<Instructions!D404,AK376,SUM(AK376:AM376))","v":0},null,null,null,{"$f":"IF(AO376<Instructions!D403,AO376,SUM(AO376:AQ376))","v":0},"--",0,{"$f":"SUM(Table_2[[#This Row],[Column20]],Table_2[[#This Row],[Column19]],Table_2[[#This Row],[Column18]])","v":0},"HEALTH & PHY. EDU.",{"$f":"(M376/Instructions!$C$23)*100","v":0},{"$f":"(P376/Instructions!$C$24)*100","v":0},{"$f":"(S376/Instructions!$C$25)*100","v":0},{"$f":"(V376/Instructions!$C$26)*100","v":0},{"$f":"(Y376/Instructions!$C$27)*100","v":0},{"$f":"(AB376/Instructions!$C$28)*100","v":0},{"$f":"(AF376/Instructions!$C$29)*100","v":0},{"$f":"(AJ376/Instructions!$C$30)*100","v":0},{"$f":"(AN376/Instructions!$C$31)*100","v":0},0,{"$f":"(AS376/Instructions!$C$33)*100","v":{"$error":"#VALUE!"}},"----","E","E","E","E","E","E","E","E","E","E","--","E",null,null,null,null,{"$f":"Table_2[[#This Row],[Column51]]&Table_2[[#This Row],[Column52]]&BU378","v":""}]
[375,null,null,null,null,null,null,null,null,null,null,null,0,null,null,0,null,null,0,null,null,0,null,null,0,null,null,0,null,null,null,0,null,null,null,{"$f":"IF(AG377<Instructions!D406,AG377,SUM(AG377:AI377))","v":0},null,null,null,{"$f":"IF(AK377<Instructions!D405,AK377,SUM(AK377:AM377))","v":0},null,null,null,{"$f":"IF(AO377<Instructions!D404,AO377,SUM(AO377:AQ377))","v":0},"--",0,{"$f":"SUM(Table_2[[#This Row],[Column20]],Table_2[[#This Row],[Column19]],Table_2[[#This Row],[Column18]])","v":0},"HEALTH & PHY. EDU.",{"$f":"(M377/Instructions!$C$23)*100","v":0},{"$f":"(P377/Instructions!$C$24)*100","v":0},{"$f":"(S377/Instructions!$C$25)*100","v":0},{"$f":"(V377/Instructions!$C$26)*100","v":0},{"$f":"(Y377/Instructions!$C$27)*100","v":0},{"$f":"(AB377/Instructions!$C$28)*100","v":0},{"$f":"(AF377/Instructions!$C$29)*100","v":0},{"$f":"(AJ377/Instructions!$C$30)*100","v":0},{"$f":"(AN377/Instructions!$C$31)*100","v":0},0,{"$f":"(AS377/Instructions!$C$33)*100","v":{"$error":"#VALUE!"}},"----","E","E","E","E","E","E","E","E","E","E","--","E",null,null,null,null,{"$f":"Table_2[[#This Row],[Column51]]&Table_2[[#This Row],[Column52]]&BU379","v":""}]
[376,null,null,null,null,null,null,null,null,null,null,null,0,null,null,0,null,null,0,null,null,0,null,null,0,null,null,0,null,null,null,0,null,null,null,{"$f":"IF(AG378<Instructions!D407,AG378,SUM(AG378:AI378))","v":0},null,null,null,{"$f":"IF(AK378<Instructions!D406,AK378,SUM(AK378:AM378))","v":0},null,null,null,{"$f":"IF(AO378<Instructions!D405,AO378,SUM(AO378:AQ378))","v":0},"--",0,{"$f":"SUM(Table_2[[#This Row],[Column20]],Table_2[[#This Row],[Column19]],Table_2[[#This Row],[Column18]])","v":0},"HEALTH & PHY. EDU.",{"$f":"(M378/Instructions!$C$23)*100","v":0},{"$f":"(P378/Instructions!$C$24)*100","v":0},{"$f":"(S378/Instructions!$C$25)*100","v":0},{"$f":"(V378/Instructions!$C$26)*100","v":0},{"$f":"(Y378/Instructions!$C$27)*100","v":0},{"$f":"(AB378/Instructions!$C$28)*100","v":0},{"$f":"(AF378/Instructions!$C$29)*100","v":0},{"$f":"(AJ378/Instructions!$C$30)*100","v":0},{"$f":"(AN378/Instructions!$C$31)*100","v":0},0,{"$f":"(AS378/Instructions!$C$33)*100","v":{"$error":"#VALUE!"}},"----","E","E","E","E","E","E","E","E","E","E","--","E",null,null,null,null,{"$f":"Table_2[[#This Row],[Column51]]&Table_2[[#This Row],[Column52]]&BU380","v":""}]
[377,null,null,null,null,null,null,null,null,null,null,null,0,null,null,0,null,null,0,null,null,0,null,null,0,null,null,0,null,null,null,0,null,null,null,{"$f":"IF(AG379<Instructions!D408,AG379,SUM(AG379:AI379))","v":0},null,null,null,{"$f":"IF(AK379<Instructions!D407,AK379,SUM(AK379:AM379))","v":0},null,null,null,{"$f":"IF(AO379<Instructions!D406,AO379,SUM(AO379:AQ379))","v":0},"--",0,{"$f":"SUM(Table_2[[#This Row],[Column20]],Table_2[[#This Row],[Column19]],Table_2[[#This Row],[Column18]])","v":0},"HEALTH & PHY. EDU.",{"$f":"(M379/Instructions!$C$23)*100","v":0},{"$f":"(P379/Instructions!$C$24)*100","v":0},{"$f":"(S379/Instructions!$C$25)*100","v":0},{"$f":"(V379/Instructions!$C$26)*100","v":0},{"$f":"(Y379/Instructions!$C$27)*100","v":0},{"$f":"(AB379/Instructions!$C$28)*100","v":0},{"$f":"(AF379/Instructions!$C$29)*100","v":0},{"$f":"(AJ379/Instructions!$C$30)*100","v":0},{"$f":"(AN379/Instructions!$C$31)*100","v":0},0,{"$f":"(AS379/Instructions!$C$33)*100","v":{"$error":"#VALUE!"}},"----","E","E","E","E","E","E","E","E","E","E","--","E",null,null,null,null,{"$f":"Table_2[[#This Row],[Column51]]&Table_2[[#This Row],[Column52]]&BU381","v":""}]
[378,null,null,null,null,null,null,null,null,null,null,null,0,null,null,0,null,null,0,null,null,0,null,null,0,null,null,0,null,null,null,0,null,null,null,{"$f":"IF(AG380<Instructions!D409,AG380,SUM(AG380:AI380))","v":0},null,null,null,{"$f":"IF(AK380<Instructions!D408,AK380,SUM(AK380:AM380))","v":0},null,null,null,{"$f":"IF(AO380<Instructions!D407,AO380,SUM(AO380:AQ380))","v":0},"--",0,{"$f":"SUM(Table_2[[#This Row],[Column20]],Table_2[[#This Row],[Column19]],Table_2[[#This Row],[Column18]])","v":0},"HEALTH & PHY. EDU.",{"$f":"(M380/Instructions!$C$23)*100","v":0},{"$f":"(P380/Instructions!$C$24)*100","v":0},{"$f":"(S380/Instructions!$C$25)*100","v":0},{"$f":"(V380/Instructions!$C$26)*100","v":0},{"$f":"(Y380/Instructions!$C$27)*100","v":0},{"$f":"(AB380/Instructions!$C$28)*100","v":0},{"$f":"(AF380/Instructions!$C$29)*100","v":0},{"$f":"(AJ380/Instructions!$C$30)*100","v":0},{"$f":"(AN380/Instructions!$C$31)*100","v":0},0,{"$f":"(AS380/Instructions!$C$33)*100","v":{"$error":"#VALUE!"}},"----","E","E","E","E","E","E","E","E","E","E","--","E",null,null,null,null,{"$f":"Table_2[[#This Row],[Column51]]&Table_2[[#This Row],[Column52]]&BU382","v":""}]
[379,null,null,null,null,null,null,null,null,null,null,null,0,null,null,0,null,null,0,null,null,0,null,null,0,null,null,0,null,null,null,0,null,null,null,{"$f":"IF(AG381<Instructions!D410,AG381,SUM(AG381:AI381))","v":0},null,null,null,{"$f":"IF(AK381<Instructions!D409,AK381,SUM(AK381:AM381))","v":0},null,null,null,{"$f":"IF(AO381<Instructions!D408,AO381,SUM(AO381:AQ381))","v":0},"--",0,{"$f":"SUM(Table_2[[#This Row],[Column20]],Table_2[[#This Row],[Column19]],Table_2[[#This Row],[Column18]])","v":0},"HEALTH & PHY. EDU.",{"$f":"(M381/Instructions!$C$23)*100","v":0},{"$f":"(P381/Instructions!$C$24)*100","v":0},{"$f":"(S381/Instructions!$C$25)*100","v":0},{"$f":"(V381/Instructions!$C$26)*100","v":0},{"$f":"(Y381/Instructions!$C$27)*100","v":0},{"$f":"(AB381/Instructions!$C$28)*100","v":0},{"$f":"(AF381/Instructions!$C$29)*100","v":0},{"$f":"(AJ381/Instructions!$C$30)*100","v":0},{"$f":"(AN381/Instructions!$C$31)*100","v":0},0,{"$f":"(AS381/Instructions!$C$33)*100","v":{"$error":"#VALUE!"}},"----","E","E","E","E","E","E","E","E","E","E","--","E",null,null,null,null,{"$f":"Table_2[[#This Row],[Column51]]&Table_2[[#This Row],[Column52]]&BU383","v":""}]
[380,null,null,null,null,null,null,null,null,null,null,null,0,null,null,0,null,null,0,null,null,0,null,null,0,null,null,0,null,null,null,0,null,null,null,{"$f":"IF(AG382<Instructions!D411,AG382,SUM(AG382:AI382))","v":0},null,null,null,{"$f":"IF(AK382<Instructions!D410,AK382,SUM(AK382:AM382))","v":0},null,null,null,{"$f":"IF(AO382<Instructions!D409,AO382,SUM(AO382:AQ382))","v":0},"--",0,{"$f":"SUM(Table_2[[#This Row],[Column20]],Table_2[[#This Row],[Column19]],Table_2[[#This Row],[Column18]])","v":0},"HEALTH & PHY. EDU.",{"$f":"(M382/Instructions!$C$23)*100","v":0},{"$f":"(P382/Instructions!$C$24)*100","v":0},{"$f":"(S382/Instructions!$C$25)*100","v":0},{"$f":"(V382/Instructions!$C$26)*100","v":0},{"$f":"(Y382/Instructions!$C$27)*100","v":0},{"$f":"(AB382/Instructions!$C$28)*100","v":0},{"$f":"(AF382/Instructions!$C$29)*100","v":0},{"$f":"(AJ382/Instructions!$C$30)*100","v":0},{"$f":"(AN382/Instructions!$C$31)*100","v":0},0,{"$f":"(AS382/Instructions!$C$33)*100","v":{"$error":"#VALUE!"}},"----","E","E","E","E","E","E","E","E","E","E","--","E",null,null,null,null,{"$f":"Table_2[[#This Row],[Column51]]&Table_2[[#This Row],[Column52]]&BU384","v":""}]
[381,null,null,null,null,null,null,null,null,null,null,null,0,null,null,0,null,null,0,null,null,0,null,null,0,null,null,0,null,null,null,0,null,null,null,{"$f":"IF(AG383<Instructions!D412,AG383,SUM(AG383:AI383))","v":0},null,null,null,{"$f":"IF(AK383<Instructions!D411,AK383,SUM(AK383:AM383))","v":0},null,null,null,{"$f":"IF(AO383<Instructions!D410,AO383,SUM(AO383:AQ383))","v":0},"--",0,{"$f":"SUM(Table_2[[#This Row],[Column20]],Table_2[[#This Row],[Column19]],Table_2[[#This Row],[Column18]])","v":0},"HEALTH & PHY. EDU.",{"$f":"(M383/Instructions!$C$23)*100","v":0},{"$f":"(P383/Instructions!$C$24)*100","v":0},{"$f":"(S383/Instructions!$C$25)*100","v":0},{"$f":"(V383/Instructions!$C$26)*100","v":0},{"$f":"(Y383/Instructions!$C$27)*100","v":0},{"$f":"(AB383/Instructions!$C$28)*100","v":0},{"$f":"(AF383/Instructions!$C$29)*100","v":0},{"$f":"(AJ383/Instructions!$C$30)*100","v":0},{"$f":"(AN383/Instructions!$C$31)*100","v":0},0,{"$f":"(AS383/Instructions!$C$33)*100","v":{"$error":"#VALUE!"}},"----","E","E","E","E","E","E","E","E","E","E","--","E",null,null,null,null,{"$f":"Table_2[[#This Row],[Column51]]&Table_2[[#This Row],[Column52]]&BU385","v":""}]
[382,null,null,null,null,null,null,null,null,null,null,null,0,null,null,0,null,null,0,null,null,0,null,null,0,null,null,0,null,null,null,0,null,null,null,{"$f":"IF(AG384<Instructions!D413,AG384,SUM(AG384:AI384))","v":0},null,null,null,{"$f":"IF(AK384<Instructions!D412,AK384,SUM(AK384:AM384))","v":0},null,null,null,{"$f":"IF(AO384<Instructions!D411,AO384,SUM(AO384:AQ384))","v":0},"--",0,{"$f":"SUM(Table_2[[#This Row],[Column20]],Table_2[[#This Row],[Column19]],Table_2[[#This Row],[Column18]])","v":0},"HEALTH & PHY. EDU.",{"$f":"(M384/Instructions!$C$23)*100","v":0},{"$f":"(P384/Instructions!$C$24)*100","v":0},{"$f":"(S384/Instructions!$C$25)*100","v":0},{"$f":"(V384/Instructions!$C$26)*100","v":0},{"$f":"(Y384/Instructions!$C$27)*100","v":0},{"$f":"(AB384/Instructions!$C$28)*100","v":0},{"$f":"(AF384/Instructions!$C$29)*100","v":0},{"$f":"(AJ384/Instructions!$C$30)*100","v":0},{"$f":"(AN384/Instructions!$C$31)*100","v":0},0,{"$f":"(AS384/Instructions!$C$33)*100","v":{"$error":"#VALUE!"}},"----","E","E","E","E","E","E","E","E","E","E","--","E",null,null,null,null,{"$f":"Table_2[[#This Row],[Column51]]&Table_2[[#This Row],[Column52]]&BU386","v":""}]
[383,null,null,null,null,null,null,null,null,null,null,null,0,null,null,0,null,null,0,null,null,0,null,null,0,null,null,0,null,null,null,0,null,null,null,{"$f":"IF(AG385<Instructions!D414,AG385,SUM(AG385:AI385))","v":0},null,null,null,{"$f":"IF(AK385<Instructions!D413,AK385,SUM(AK385:AM385))","v":0},null,null,null,{"$f":"IF(AO385<Instructions!D412,AO385,SUM(AO385:AQ385))","v":0},"--",0,{"$f":"SUM(Table_2[[#This Row],[Column20]],Table_2[[#This Row],[Column19]],Table_2[[#This Row],[Column18]])","v":0},"HEALTH & PHY. EDU.",{"$f":"(M385/Instructions!$C$23)*100","v":0},{"$f":"(P385/Instructions!$C$24)*100","v":0},{"$f":"(S385/Instructions!$C$25)*100","v":0},{"$f":"(V385/Instructions!$C$26)*100","v":0},{"$f":"(Y385/Instructions!$C$27)*100","v":0},{"$f":"(AB385/Instructions!$C$28)*100","v":0},{"$f":"(AF385/Instructions!$C$29)*100","v":0},{"$f":"(AJ385/Instructions!$C$30)*100","v":0},{"$f":"(AN385/Instructions!$C$31)*100","v":0},0,{"$f":"(AS385/Instructions!$C$33)*100","v":{"$error":"#VALUE!"}},"----","E","E","E","E","E","E","E","E","E","E","--","E",null,null,null,null,{"$f":"Table_2[[#This Row],[Column51]]&Table_2[[#This Row],[Column52]]&BU387","v":""}]
[384,null,null,null,null,null,null,null,null,null,null,null,0,null,null,0,null,null,0,null,null,0,null,null,0,null,null,0,null,null,null,0,null,null,null,{"$f":"IF(AG386<Instructions!D415,AG386,SUM(AG386:AI386))","v":0},null,null,null,{"$f":"IF(AK386<Instructions!D414,AK386,SUM(AK386:AM386))","v":0},null,null,null,{"$f":"IF(AO386<Instructions!D413,AO386,SUM(AO386:AQ386))","v":0},"--",0,{"$f":"SUM(Table_2[[#This Row],[Column20]],Table_2[[#This Row],[Column19]],Table_2[[#This Row],[Column18]])","v":0},"HEALTH & PHY. EDU.",{"$f":"(M386/Instructions!$C$23)*100","v":0},{"$f":"(P386/Instructions!$C$24)*100","v":0},{"$f":"(S386/Instructions!$C$25)*100","v":0},{"$f":"(V386/Instructions!$C$26)*100","v":0},{"$f":"(Y386/Instructions!$C$27)*100","v":0},{"$f":"(AB386/Instructions!$C$28)*100","v":0},{"$f":"(AF386/Instructions!$C$29)*100","v":0},{"$f":"(AJ386/Instructions!$C$30)*100","v":0},{"$f":"(AN386/Instructions!$C$31)*100","v":0},0,{"$f":"(AS386/Instructions!$C$33)*100","v":{"$error":"#VALUE!"}},"----","E","E","E","E","E","E","E","E","E","E","--","E",null,null,null,null,{"$f":"Table_2[[#This Row],[Column51]]&Table_2[[#This Row],[Column52]]&BU388","v":""}]
[385,null,null,null,null,null,null,null,null,null,null,null,0,null,null,0,null,null,0,null,null,0,null,null,0,null,null,0,null,null,null,0,null,null,null,{"$f":"IF(AG387<Instructions!D416,AG387,SUM(AG387:AI387))","v":0},null,null,null,{"$f":"IF(AK387<Instructions!D415,AK387,SUM(AK387:AM387))","v":0},null,null,null,{"$f":"IF(AO387<Instructions!D414,AO387,SUM(AO387:AQ387))","v":0},"--",0,{"$f":"SUM(Table_2[[#This Row],[Column20]],Table_2[[#This Row],[Column19]],Table_2[[#This Row],[Column18]])","v":0},"HEALTH & PHY. EDU.",{"$f":"(M387/Instructions!$C$23)*100","v":0},{"$f":"(P387/Instructions!$C$24)*100","v":0},{"$f":"(S387/Instructions!$C$25)*100","v":0},{"$f":"(V387/Instructions!$C$26)*100","v":0},{"$f":"(Y387/Instructions!$C$27)*100","v":0},{"$f":"(AB387/Instructions!$C$28)*100","v":0},{"$f":"(AF387/Instructions!$C$29)*100","v":0},{"$f":"(AJ387/Instructions!$C$30)*100","v":0},{"$f":"(AN387/Instructions!$C$31)*100","v":0},0,{"$f":"(AS387/Instructions!$C$33)*100","v":{"$error":"#VALUE!"}},"----","E","E","E","E","E","E","E","E","E","E","--","E",null,null,null,null,{"$f":"Table_2[[#This Row],[Column51]]&Table_2[[#This Row],[Column52]]&BU389","v":""}]
[386,null,null,null,null,null,null,null,null,null,null,null,{"$f":"IF(K388<33,K388,SUM(K388:L388))","v":0},null,null,{"$f":"IF(N388<20,N388,SUM(N388:O388))","v":0},null,null,{"$f":"IF(Q388<20,Q388,SUM(Q388:R388))","v":0},null,null,{"$f":"IF(T388<20,T388,SUM(T388:U388))","v":0},null,null,{"$f":"IF(W388<20,W388,SUM(W388:X388))","v":0},null,null,{"$f":"IF(Z388<20,Z388,SUM(Z388:AA388))","v":0},null,null,null,{"$f":"IF(AC388<10,AC388,SUM(AC388:AE388))","v":0},null,null,null,{"$f":"IF(AG388<Instructions!D417,AG388,SUM(AG388:AI388))","v":0},null,null,null,{"$f":"IF(AK388<Instructions!D416,AK388,SUM(AK388:AM388))","v":0},null,null,null,{"$f":"IF(AO388<Instructions!D415,AO388,SUM(AO388:AQ388))","v":0},{"$f":"IF(MIN(M388,P388,S388,V388,Y388,AB388)>=33,SUM(M388,P388,S388,V388,Y388,AB388),\"--\")","v":"--"},{"$f":"IF(AS388=\"--\",0,AS388)","v":0},{"$f":"SUM(Table_2[[#This Row],[Column20]],Table_2[[#This Row],[Column19]],Table_2[[#This Row],[Column18]])","v":0},{"$f":"IF(N(AJ388)>0,$AG$1,IF(N(AN388)>0,$AK$1,$AO$1))","v":"HEALTH & PHY. EDU."},{"$f":"(M388/Instructions!$C$23)*100","v":0},{"$f":"(P388/Instructions!$C$24)*100","v":0},{"$f":"(S388/Instructions!$C$25)*100","v":0},{"$f":"(V388/Instructions!$C$26)*100","v":0},{"$f":"(Y388/Instructions!$C$27)*100","v":0},{"$f":"(AB388/Instructions!$C$28)*100","v":0},{"$f":"(AF388/Instructions!$C$29)*100","v":0},{"$f":"(AJ388/Instructions!$C$30)*100","v":0},{"$f":"(AN388/Instructions!$C$31)*100","v":0},{"$f":"(AR388/100)*100","v":0},{"$f":"(AS388/Instructions!$C$33)*100","v":{"$error":"#VALUE!"}},{"$f":"IF(AND(AW388>=33,AX388>=33,AY388>=33,AZ388>=33,BA388>=33,BB388>=33),\"PASS\",\"----\")","v":"----"},"E","E","E","E","E","E","E","E","E","E",{"$f":"IFERROR(IF(BG388>90,\"A+\",IF(BG388>80,\"A\",IF(BG388>70,\"B+\",IF(BG388>60,\"B\",IF(BG388>50,\"C+\",IF(BG388>40,\"C\",IF(BG388>=33,\"D\",\"E\"))))))),\"--\")","v":"--"},{"$f":"IFERROR(IF(BF388>90,\"A+\",IF(BF388>80,\"A\",IF(BF388>70,\"B+\",IF(BF388>60,\"B\",IF(BF388>50,\"C+\",IF(BF388>40,\"C\",IF(BF388>=33,\"D\",\"E\"))))))),\"Abs\")","v":"E"},null,null,null,null,{"$f":"Table_2[[#This Row],[Column51]]&Table_2[[#This Row],[Column52]]&BU390","v":""}]
[387,null,null,null,null,null,null,null,null,null,null,null,0,null,null,0,null,null,0,null,null,0,null,null,0,null,null,0,null,null,null,0,null,null,null,{"$f":"IF(AG389<Instructions!D418,AG389,SUM(AG389:AI389))","v":0},null,null,null,{"$f":"IF(AK389<Instructions!D417,AK389,SUM(AK389:AM389))","v":0},null,null,null,{"$f":"IF(AO389<Instructions!D416,AO389,SUM(AO389:AQ389))","v":0},"--",0,{"$f":"SUM(Table_2[[#This Row],[Column20]],Table_2[[#This Row],[Column19]],Table_2[[#This Row],[Column18]])","v":0},"HEALTH & PHY. EDU.",{"$f":"(M389/Instructions!$C$23)*100","v":0},{"$f":"(P389/Instructions!$C$24)*100","v":0},{"$f":"(S389/Instructions!$C$25)*100","v":0},{"$f":"(V389/Instructions!$C$26)*100","v":0},{"$f":"(Y389/Instructions!$C$27)*100","v":0},{"$f":"(AB389/Instructions!$C$28)*100","v":0},{"$f":"(AF389/Instructions!$C$29)*100","v":0},{"$f":"(AJ389/Instructions!$C$30)*100","v":0},{"$f":"(AN389/Instructions!$C$31)*100","v":0},0,{"$f":"(AS389/Instructions!$C$33)*100","v":{"$error":"#VALUE!"}},"----","E","E","E","E","E","E","E","E","E","E","--","E",null,null,null,null,{"$f":"Table_2[[#This Row],[Column51]]&Table_2[[#This Row],[Column52]]&BU391","v":""}]
[388,null,null,null,null,null,null,null,null,null,null,null,0,null,null,0,null,null,0,null,null,0,null,null,0,null,null,0,null,null,null,0,null,null,null,{"$f":"IF(AG390<Instructions!D419,AG390,SUM(AG390:AI390))","v":0},null,null,null,{"$f":"IF(AK390<Instructions!D418,AK390,SUM(AK390:AM390))","v":0},null,null,null,{"$f":"IF(AO390<Instructions!D417,AO390,SUM(AO390:AQ390))","v":0},"--",0,{"$f":"SUM(Table_2[[#This Row],[Column20]],Table_2[[#This Row],[Column19]],Table_2[[#This Row],[Column18]])","v":0},"HEALTH & PHY. EDU.",{"$f":"(M390/Instructions!$C$23)*100","v":0},{"$f":"(P390/Instructions!$C$24)*100","v":0},{"$f":"(S390/Instructions!$C$25)*100","v":0},{"$f":"(V390/Instructions!$C$26)*100","v":0},{"$f":"(Y390/Instructions!$C$27)*100","v":0},{"$f":"(AB390/Instructions!$C$28)*100","v":0},{"$f":"(AF390/Instructions!$C$29)*100","v":0},{"$f":"(AJ390/Instructions!$C$30)*100","v":0},{"$f":"(AN390/Instructions!$C$31)*100","v":0},0,{"$f":"(AS390/Instructions!$C$33)*100","v":{"$error":"#VALUE!"}},"----","E","E","E","E","E","E","E","E","E","E","--","E",null,null,null,null,{"$f":"Table_2[[#This Row],[Column51]]&Table_2[[#This Row],[Column52]]&BU392","v":""}]
[389,null,null,null,null,null,null,null,null,null,null,null,0,null,null,0,null,null,0,null,null,0,null,null,0,null,null,0,null,null,null,0,null,null,null,{"$f":"IF(AG391<Instructions!D420,AG391,SUM(AG391:AI391))","v":0},null,null,null,{"$f":"IF(AK391<Instructions!D419,AK391,SUM(AK391:AM391))","v":0},null,null,null,{"$f":"IF(AO391<Instructions!D418,AO391,SUM(AO391:AQ391))","v":0},"--",0,{"$f":"SUM(Table_2[[#This Row],[Column20]],Table_2[[#This Row],[Column19]],Table_2[[#This Row],[Column18]])","v":0},"HEALTH & PHY. EDU.",{"$f":"(M391/Instructions!$C$23)*100","v":0},{"$f":"(P391/Instructions!$C$24)*100","v":0},{"$f":"(S391/Instructions!$C$25)*100","v":0},{"$f":"(V391/Instructions!$C$26)*100","v":0},{"$f":"(Y391/Instructions!$C$27)*100","v":0},{"$f":"(AB391/Instructions!$C$28)*100","v":0},{"$f":"(AF391/Instructions!$C$29)*100","v":0},{"$f":"(AJ391/Instructions!$C$30)*100","v":0},{"$f":"(AN391/Instructions!$C$31)*100","v":0},0,{"$f":"(AS391/Instructions!$C$33)*100","v":{"$error":"#VALUE!"}},"----","E","E","E","E","E","E","E","E","E","E","--","E",null,null,null,null,{"$f":"Table_2[[#This Row],[Column51]]&Table_2[[#This Row],[Column52]]&BU393","v":""}]
[390,null,null,null,null,null,null,null,null,null,null,null,0,null,null,0,null,null,0,null,null,0,null,null,0,null,null,0,null,null,null,0,null,null,null,{"$f":"IF(AG392<Instructions!D421,AG392,SUM(AG392:AI392))","v":0},null,null,null,{"$f":"IF(AK392<Instructions!D420,AK392,SUM(AK392:AM392))","v":0},null,null,null,{"$f":"IF(AO392<Instructions!D419,AO392,SUM(AO392:AQ392))","v":0},"--",0,{"$f":"SUM(Table_2[[#This Row],[Column20]],Table_2[[#This Row],[Column19]],Table_2[[#This Row],[Column18]])","v":0},"HEALTH & PHY. EDU.",{"$f":"(M392/Instructions!$C$23)*100","v":0},{"$f":"(P392/Instructions!$C$24)*100","v":0},{"$f":"(S392/Instructions!$C$25)*100","v":0},{"$f":"(V392/Instructions!$C$26)*100","v":0},{"$f":"(Y392/Instructions!$C$27)*100","v":0},{"$f":"(AB392/Instructions!$C$28)*100","v":0},{"$f":"(AF392/Instructions!$C$29)*100","v":0},{"$f":"(AJ392/Instructions!$C$30)*100","v":0},{"$f":"(AN392/Instructions!$C$31)*100","v":0},0,{"$f":"(AS392/Instructions!$C$33)*100","v":{"$error":"#VALUE!"}},"----","E","E","E","E","E","E","E","E","E","E","--","E",null,null,null,null,{"$f":"Table_2[[#This Row],[Column51]]&Table_2[[#This Row],[Column52]]&BU394","v":""}]
[391,null,null,null,null,null,null,null,null,null,null,null,0,null,null,0,null,null,0,null,null,0,null,null,0,null,null,0,null,null,null,0,null,null,null,{"$f":"IF(AG393<Instructions!D422,AG393,SUM(AG393:AI393))","v":0},null,null,null,{"$f":"IF(AK393<Instructions!D421,AK393,SUM(AK393:AM393))","v":0},null,null,null,{"$f":"IF(AO393<Instructions!D420,AO393,SUM(AO393:AQ393))","v":0},"--",0,{"$f":"SUM(Table_2[[#This Row],[Column20]],Table_2[[#This Row],[Column19]],Table_2[[#This Row],[Column18]])","v":0},"HEALTH & PHY. EDU.",{"$f":"(M393/Instructions!$C$23)*100","v":0},{"$f":"(P393/Instructions!$C$24)*100","v":0},{"$f":"(S393/Instructions!$C$25)*100","v":0},{"$f":"(V393/Instructions!$C$26)*100","v":0},{"$f":"(Y393/Instructions!$C$27)*100","v":0},{"$f":"(AB393/Instructions!$C$28)*100","v":0},{"$f":"(AF393/Instructions!$C$29)*100","v":0},{"$f":"(AJ393/Instructions!$C$30)*100","v":0},{"$f":"(AN393/Instructions!$C$31)*100","v":0},0,{"$f":"(AS393/Instructions!$C$33)*100","v":{"$error":"#VALUE!"}},"----","E","E","E","E","E","E","E","E","E","E","--","E",null,null,null,null,{"$f":"Table_2[[#This Row],[Column51]]&Table_2[[#This Row],[Column52]]&BU395","v":""}]
[392,null,null,null,null,null,null,null,null,null,null,null,0,null,null,0,null,null,0,null,null,0,null,null,0,null,null,0,null,null,null,0,null,null,null,{"$f":"IF(AG394<Instructions!D423,AG394,SUM(AG394:AI394))","v":0},null,null,null,{"$f":"IF(AK394<Instructions!D422,AK394,SUM(AK394:AM394))","v":0},null,null,null,{"$f":"IF(AO394<Instructions!D421,AO394,SUM(AO394:AQ394))","v":0},"--",0,{"$f":"SUM(Table_2[[#This Row],[Column20]],Table_2[[#This Row],[Column19]],Table_2[[#This Row],[Column18]])","v":0},"HEALTH & PHY. EDU.",{"$f":"(M394/Instructions!$C$23)*100","v":0},{"$f":"(P394/Instructions!$C$24)*100","v":0},{"$f":"(S394/Instructions!$C$25)*100","v":0},{"$f":"(V394/Instructions!$C$26)*100","v":0},{"$f":"(Y394/Instructions!$C$27)*100","v":0},{"$f":"(AB394/Instructions!$C$28)*100","v":0},{"$f":"(AF394/Instructions!$C$29)*100","v":0},{"$f":"(AJ394/Instructions!$C$30)*100","v":0},{"$f":"(AN394/Instructions!$C$31)*100","v":0},0,{"$f":"(AS394/Instructions!$C$33)*100","v":{"$error":"#VALUE!"}},"----","E","E","E","E","E","E","E","E","E","E","--","E",null,null,null,null,{"$f":"Table_2[[#This Row],[Column51]]&Table_2[[#This Row],[Column52]]&BU396","v":""}]
[393,null,null,null,null,null,null,null,null,null,null,null,0,null,null,0,null,null,0,null,null,0,null,null,0,null,null,0,null,null,null,0,null,null,null,{"$f":"IF(AG395<Instructions!D424,AG395,SUM(AG395:AI395))","v":0},null,null,null,{"$f":"IF(AK395<Instructions!D423,AK395,SUM(AK395:AM395))","v":0},null,null,null,{"$f":"IF(AO395<Instructions!D422,AO395,SUM(AO395:AQ395))","v":0},"--",0,{"$f":"SUM(Table_2[[#This Row],[Column20]],Table_2[[#This Row],[Column19]],Table_2[[#This Row],[Column18]])","v":0},"HEALTH & PHY. EDU.",{"$f":"(M395/Instructions!$C$23)*100","v":0},{"$f":"(P395/Instructions!$C$24)*100","v":0},{"$f":"(S395/Instructions!$C$25)*100","v":0},{"$f":"(V395/Instructions!$C$26)*100","v":0},{"$f":"(Y395/Instructions!$C$27)*100","v":0},{"$f":"(AB395/Instructions!$C$28)*100","v":0},{"$f":"(AF395/Instructions!$C$29)*100","v":0},{"$f":"(AJ395/Instructions!$C$30)*100","v":0},{"$f":"(AN395/Instructions!$C$31)*100","v":0},0,{"$f":"(AS395/Instructions!$C$33)*100","v":{"$error":"#VALUE!"}},"----","E","E","E","E","E","E","E","E","E","E","--","E",null,null,null,null,{"$f":"Table_2[[#This Row],[Column51]]&Table_2[[#This Row],[Column52]]&BU397","v":""}]
[394,null,null,null,null,null,null,null,null,null,null,null,0,null,null,0,null,null,0,null,null,0,null,null,0,null,null,0,null,null,null,0,null,null,null,{"$f":"IF(AG396<Instructions!D425,AG396,SUM(AG396:AI396))","v":0},null,null,null,{"$f":"IF(AK396<Instructions!D424,AK396,SUM(AK396:AM396))","v":0},null,null,null,{"$f":"IF(AO396<Instructions!D423,AO396,SUM(AO396:AQ396))","v":0},"--",0,{"$f":"SUM(Table_2[[#This Row],[Column20]],Table_2[[#This Row],[Column19]],Table_2[[#This Row],[Column18]])","v":0},"HEALTH & PHY. EDU.",{"$f":"(M396/Instructions!$C$23)*100","v":0},{"$f":"(P396/Instructions!$C$24)*100","v":0},{"$f":"(S396/Instructions!$C$25)*100","v":0},{"$f":"(V396/Instructions!$C$26)*100","v":0},{"$f":"(Y396/Instructions!$C$27)*100","v":0},{"$f":"(AB396/Instructions!$C$28)*100","v":0},{"$f":"(AF396/Instructions!$C$29)*100","v":0},{"$f":"(AJ396/Instructions!$C$30)*100","v":0},{"$f":"(AN396/Instructions!$C$31)*100","v":0},0,{"$f":"(AS396/Instructions!$C$33)*100","v":{"$error":"#VALUE!"}},"----","E","E","E","E","E","E","E","E","E","E","--","E",null,null,null,null,{"$f":"Table_2[[#This Row],[Column51]]&Table_2[[#This Row],[Column52]]&BU398","v":""}]
[395,null,null,null,null,null,null,null,null,null,null,null,0,null,null,0,null,null,0,null,null,0,null,null,0,null,null,0,null,null,null,0,null,null,null,{"$f":"IF(AG397<Instructions!D426,AG397,SUM(AG397:AI397))","v":0},null,null,null,{"$f":"IF(AK397<Instructions!D425,AK397,SUM(AK397:AM397))","v":0},null,null,null,{"$f":"IF(AO397<Instructions!D424,AO397,SUM(AO397:AQ397))","v":0},"--",0,{"$f":"SUM(Table_2[[#This Row],[Column20]],Table_2[[#This Row],[Column19]],Table_2[[#This Row],[Column18]])","v":0},"HEALTH & PHY. EDU.",{"$f":"(M397/Instructions!$C$23)*100","v":0},{"$f":"(P397/Instructions!$C$24)*100","v":0},{"$f":"(S397/Instructions!$C$25)*100","v":0},{"$f":"(V397/Instructions!$C$26)*100","v":0},{"$f":"(Y397/Instructions!$C$27)*100","v":0},{"$f":"(AB397/Instructions!$C$28)*100","v":0},{"$f":"(AF397/Instructions!$C$29)*100","v":0},{"$f":"(AJ397/Instructions!$C$30)*100","v":0},{"$f":"(AN397/Instructions!$C$31)*100","v":0},0,{"$f":"(AS397/Instructions!$C$33)*100","v":{"$error":"#VALUE!"}},"----","E","E","E","E","E","E","E","E","E","E","--","E",null,null,null,null,{"$f":"Table_2[[#This Row],[Column51]]&Table_2[[#This Row],[Column52]]&BU399","v":""}]
[396,null,null,null,null,null,null,null,null,null,null,null,0,null,null,0,null,null,0,null,null,0,null,null,0,null,null,0,null,null,null,0,null,null,null,{"$f":"IF(AG398<Instructions!D427,AG398,SUM(AG398:AI398))","v":0},null,null,null,{"$f":"IF(AK398<Instructions!D426,AK398,SUM(AK398:AM398))","v":0},null,null,null,{"$f":"IF(AO398<Instructions!D425,AO398,SUM(AO398:AQ398))","v":0},"--",0,{"$f":"SUM(Table_2[[#This Row],[Column20]],Table_2[[#This Row],[Column19]],Table_2[[#This Row],[Column18]])","v":0},"HEALTH & PHY. EDU.",{"$f":"(M398/Instructions!$C$23)*100","v":0},{"$f":"(P398/Instructions!$C$24)*100","v":0},{"$f":"(S398/Instructions!$C$25)*100","v":0},{"$f":"(V398/Instructions!$C$26)*100","v":0},{"$f":"(Y398/Instructions!$C$27)*100","v":0},{"$f":"(AB398/Instructions!$C$28)*100","v":0},{"$f":"(AF398/Instructions!$C$29)*100","v":0},{"$f":"(AJ398/Instructions!$C$30)*100","v":0},{"$f":"(AN398/Instructions!$C$31)*100","v":0},0,{"$f":"(AS398/Instructions!$C$33)*100","v":{"$error":"#VALUE!"}},"----","E","E","E","E","E","E","E","E","E","E","--","E",null,null,null,null,{"$f":"Table_2[[#This Row],[Column51]]&Table_2[[#This Row],[Column52]]&BU400","v":""}]
[397,null,null,null,null,null,null,null,null,null,null,null,0,null,null,0,null,null,0,null,null,0,null,null,0,null,null,0,null,null,null,0,null,null,null,{"$f":"IF(AG399<Instructions!D428,AG399,SUM(AG399:AI399))","v":0},null,null,null,{"$f":"IF(AK399<Instructions!D427,AK399,SUM(AK399:AM399))","v":0},null,null,null,{"$f":"IF(AO399<Instructions!D426,AO399,SUM(AO399:AQ399))","v":0},"--",0,{"$f":"SUM(Table_2[[#This Row],[Column20]],Table_2[[#This Row],[Column19]],Table_2[[#This Row],[Column18]])","v":0},"HEALTH & PHY. EDU.",{"$f":"(M399/Instructions!$C$23)*100","v":0},{"$f":"(P399/Instructions!$C$24)*100","v":0},{"$f":"(S399/Instructions!$C$25)*100","v":0},{"$f":"(V399/Instructions!$C$26)*100","v":0},{"$f":"(Y399/Instructions!$C$27)*100","v":0},{"$f":"(AB399/Instructions!$C$28)*100","v":0},{"$f":"(AF399/Instructions!$C$29)*100","v":0},{"$f":"(AJ399/Instructions!$C$30)*100","v":0},{"$f":"(AN399/Instructions!$C$31)*100","v":0},0,{"$f":"(AS399/Instructions!$C$33)*100","v":{"$error":"#VALUE!"}},"----","E","E","E","E","E","E","E","E","E","E","--","E",null,null,null,null,{"$f":"Table_2[[#This Row],[Column51]]&Table_2[[#This Row],[Column52]]&BU401","v":""}]
[398,null,null,null,null,null,null,null,null,null,null,null,0,null,null,0,null,null,0,null,null,0,null,null,0,null,null,0,null,null,null,0,null,null,null,{"$f":"IF(AG400<Instructions!D429,AG400,SUM(AG400:AI400))","v":0},null,null,null,{"$f":"IF(AK400<Instructions!D428,AK400,SUM(AK400:AM400))","v":0},null,null,null,{"$f":"IF(AO400<Instructions!D427,AO400,SUM(AO400:AQ400))","v":0},"--",0,{"$f":"SUM(Table_2[[#This Row],[Column20]],Table_2[[#This Row],[Column19]],Table_2[[#This Row],[Column18]])","v":0},"HEALTH & PHY. EDU.",{"$f":"(M400/Instructions!$C$23)*100","v":0},{"$f":"(P400/Instructions!$C$24)*100","v":0},{"$f":"(S400/Instructions!$C$25)*100","v":0},{"$f":"(V400/Instructions!$C$26)*100","v":0},{"$f":"(Y400/Instructions!$C$27)*100","v":0},{"$f":"(AB400/Instructions!$C$28)*100","v":0},{"$f":"(AF400/Instructions!$C$29)*100","v":0},{"$f":"(AJ400/Instructions!$C$30)*100","v":0},{"$f":"(AN400/Instructions!$C$31)*100","v":0},0,{"$f":"(AS400/Instructions!$C$33)*100","v":{"$error":"#VALUE!"}},"----","E","E","E","E","E","E","E","E","E","E","--","E",null,null,null,null,{"$f":"Table_2[[#This Row],[Column51]]&Table_2[[#This Row],[Column52]]&BU402","v":""}]
[399,null,null,null,null,null,null,null,null,null,null,null,0,null,null,0,null,null,0,null,null,0,null,null,0,null,null,0,null,null,null,0,null,null,null,{"$f":"IF(AG401<Instructions!D430,AG401,SUM(AG401:AI401))","v":0},null,null,null,{"$f":"IF(AK401<Instructions!D429,AK401,SUM(AK401:AM401))","v":0},null,null,null,{"$f":"IF(AO401<Instructions!D428,AO401,SUM(AO401:AQ401))","v":0},"--",0,{"$f":"SUM(Table_2[[#This Row],[Column20]],Table_2[[#This Row],[Column19]],Table_2[[#This Row],[Column18]])","v":0},"HEALTH & PHY. EDU.",{"$f":"(M401/Instructions!$C$23)*100","v":0},{"$f":"(P401/Instructions!$C$24)*100","v":0},{"$f":"(S401/Instructions!$C$25)*100","v":0},{"$f":"(V401/Instructions!$C$26)*100","v":0},{"$f":"(Y401/Instructions!$C$27)*100","v":0},{"$f":"(AB401/Instructions!$C$28)*100","v":0},{"$f":"(AF401/Instructions!$C$29)*100","v":0},{"$f":"(AJ401/Instructions!$C$30)*100","v":0},{"$f":"(AN401/Instructions!$C$31)*100","v":0},0,{"$f":"(AS401/Instructions!$C$33)*100","v":{"$error":"#VALUE!"}},"----","E","E","E","E","E","E","E","E","E","E","--","E",null,null,null,null,{"$f":"Table_2[[#This Row],[Column51]]&Table_2[[#This Row],[Column52]]&BU403","v":""}]
[400,null,null,null,null,null,null,null,null,null,null,null,0,null,null,0,null,null,0,null,null,0,null,null,0,null,null,0,null,null,null,0,null,null,null,{"$f":"IF(AG402<Instructions!D431,AG402,SUM(AG402:AI402))","v":0},null,null,null,{"$f":"IF(AK402<Instructions!D430,AK402,SUM(AK402:AM402))","v":0},null,null,null,{"$f":"IF(AO402<Instructions!D429,AO402,SUM(AO402:AQ402))","v":0},"--",0,{"$f":"SUM(Table_2[[#This Row],[Column20]],Table_2[[#This Row],[Column19]],Table_2[[#This Row],[Column18]])","v":0},"HEALTH & PHY. EDU.",{"$f":"(M402/Instructions!$C$23)*100","v":0},{"$f":"(P402/Instructions!$C$24)*100","v":0},{"$f":"(S402/Instructions!$C$25)*100","v":0},{"$f":"(V402/Instructions!$C$26)*100","v":0},{"$f":"(Y402/Instructions!$C$27)*100","v":0},{"$f":"(AB402/Instructions!$C$28)*100","v":0},{"$f":"(AF402/Instructions!$C$29)*100","v":0},{"$f":"(AJ402/Instructions!$C$30)*100","v":0},{"$f":"(AN402/Instructions!$C$31)*100","v":0},0,{"$f":"(AS402/Instructions!$C$33)*100","v":{"$error":"#VALUE!"}},"----","E","E","E","E","E","E","E","E","E","E","--","E",null,null,null,null,{"$f":"Table_2[[#This Row],[Column51]]&Table_2[[#This Row],[Column52]]&BU404","v":""}]
[null,null,null,null,null,null,null,null,null,null,null,null,0,null,null,0,null,null,0,null,null,0,null,null,0,null,null,0,null,null,null,0,null,null,null,{"$f":"IF(AG403<Instructions!D432,AG403,SUM(AG403:AI403))","v":0},null,null,null,{"$f":"IF(AK403<Instructions!D431,AK403,SUM(AK403:AM403))","v":0},null,null,null,{"$f":"IF(AO403<Instructions!D430,AO403,SUM(AO403:AQ403))","v":0},null,null,{"$f":"SUM(Table_2[[#This Row],[Column20]],Table_2[[#This Row],[Column19]],Table_2[[#This Row],[Column18]])","v":0},"HEALTH & PHY. EDU.",null,null,null,null,null,null,null,null,null,{"$f":"(AU403/100)*100","v":0},null,null,null,null,null,null,null,null,null,null,null,null,null,"E",null,null,null,null,{"$f":"Table_2[[#This Row],[Column51]]&Table_2[[#This Row],[Column52]]&BU504","v":""}]
[null,null,null,null,null,null,null,null,null,null,null,null,0,null,null,0,null,null,0,null,null,0,null,null,0,null,null,0,null,null,null,0,null,null,null,{"$f":"IF(AG404<Instructions!D433,AG404,SUM(AG404:AI404))","v":0},null,null,null,{"$f":"IF(AK404<Instructions!D432,AK404,SUM(AK404:AM404))","v":0},null,null,null,{"$f":"IF(AO404<Instructions!D431,AO404,SUM(AO404:AQ404))","v":0},null,null,{"$f":"SUM(Table_2[[#This Row],[Column20]],Table_2[[#This Row],[Column19]],Table_2[[#This Row],[Column18]])","v":0},"HEALTH & PHY. EDU.",null,null,null,null,null,null,null,null,null,0,null,null,null,null,null,null,null,null,null,null,null,null,null,"E",null,null,null,null,{"$f":"Table_2[[#This Row],[Column51]]&Table_2[[#This Row],[Column52]]&BU505","v":""}]
[null,null,null,null,null,null,null,null,null,null,null,null,0,null,null,0,null,null,0,null,null,0,null,null,0,null,null,0,null,null,null,0,null,null,null,{"$f":"IF(AG405<Instructions!D434,AG405,SUM(AG405:AI405))","v":0},null,null,null,{"$f":"IF(AK405<Instructions!D433,AK405,SUM(AK405:AM405))","v":0},null,null,null,{"$f":"IF(AO405<Instructions!D432,AO405,SUM(AO405:AQ405))","v":0},null,null,{"$f":"SUM(Table_2[[#This Row],[Column20]],Table_2[[#This Row],[Column19]],Table_2[[#This Row],[Column18]])","v":0},"HEALTH & PHY. EDU.",null,null,null,null,null,null,null,null,null,0,null,null,null,null,null,null,null,null,null,null,null,null,null,"E",null,null,null,null,{"$f":"Table_2[[#This Row],[Column51]]&Table_2[[#This Row],[Column52]]&BU407","v":""}]
[null,null,null,null,null,null,null,null,null,null,null,null,0,null,null,0,null,null,0,null,null,0,null,null,0,null,null,0,null,null,null,0,null,null,null,{"$f":"IF(AG406<Instructions!D435,AG406,SUM(AG406:AI406))","v":0},null,null,null,{"$f":"IF(AK406<Instructions!D434,AK406,SUM(AK406:AM406))","v":0},null,null,null,{"$f":"IF(AO406<Instructions!D433,AO406,SUM(AO406:AQ406))","v":0},null,null,{"$f":"SUM(Table_2[[#This Row],[Column20]],Table_2[[#This Row],[Column19]],Table_2[[#This Row],[Column18]])","v":0},"HEALTH & PHY. EDU.",null,null,null,null,null,null,null,null,null,0,null,null,null,null,null,null,null,null,null,null,null,null,null,"E",null,null,null,null,{"$f":"Table_2[[#This Row],[Column51]]&Table_2[[#This Row],[Column52]]&BU408","v":""}]
[null,null,null,null,null,null,null,null,null,null,null,null,0,null,null,0,null,null,0,null,null,0,null,null,0,null,null,0,null,null,null,0,null,null,null,{"$f":"IF(AG407<Instructions!D436,AG407,SUM(AG407:AI407))","v":0},null,null,null,{"$f":"IF(AK407<Instructions!D435,AK407,SUM(AK407:AM407))","v":0},null,null,null,{"$f":"IF(AO407<Instructions!D434,AO407,SUM(AO407:AQ407))","v":0},null,null,{"$f":"SUM(Table_2[[#This Row],[Column20]],Table_2[[#This Row],[Column19]],Table_2[[#This Row],[Column18]])","v":0},"HEALTH & PHY. EDU.",null,null,null,null,null,null,null,null,null,0,null,null,null,null,null,null,null,null,null,null,null,null,null,"E",null,null,null,null,{"$f":"Table_2[[#This Row],[Column51]]&Table_2[[#This Row],[Column52]]&BU409","v":""}]
[null,null,null,null,null,null,null,null,null,null,null,null,0,null,null,0,null,null,0,null,null,0,null,null,0,null,null,0,null,null,null,0,null,null,null,{"$f":"IF(AG408<Instructions!D437,AG408,SUM(AG408:AI408))","v":0},null,null,null,{"$f":"IF(AK408<Instructions!D436,AK408,SUM(AK408:AM408))","v":0},null,null,null,{"$f":"IF(AO408<Instructions!D435,AO408,SUM(AO408:AQ408))","v":0},null,null,{"$f":"SUM(Table_2[[#This Row],[Column20]],Table_2[[#This Row],[Column19]],Table_2[[#This Row],[Column18]])","v":0},"HEALTH & PHY. EDU.",null,null,null,null,null,null,null,null,null,0,null,null,null,null,null,null,null,null,null,null,null,null,null,"E",null,null,null,null,{"$f":"Table_2[[#This Row],[Column51]]&Table_2[[#This Row],[Column52]]&BU410","v":""}]
[null,null,null,null,null,null,null,null,null,null,null,null,0,null,null,0,null,null,0,null,null,0,null,null,0,null,null,0,null,null,null,0,null,null,null,{"$f":"IF(AG409<Instructions!D438,AG409,SUM(AG409:AI409))","v":0},null,null,null,{"$f":"IF(AK409<Instructions!D437,AK409,SUM(AK409:AM409))","v":0},null,null,null,{"$f":"IF(AO409<Instructions!D436,AO409,SUM(AO409:AQ409))","v":0},null,null,{"$f":"SUM(Table_2[[#This Row],[Column20]],Table_2[[#This Row],[Column19]],Table_2[[#This Row],[Column18]])","v":0},"HEALTH & PHY. EDU.",null,null,null,null,null,null,null,null,null,0,null,null,null,null,null,null,null,null,null,null,null,null,null,"E",null,null,null,null,{"$f":"Table_2[[#This Row],[Column51]]&Table_2[[#This Row],[Column52]]&BU411","v":""}]
[null,null,null,null,null,null,null,null,null,null,null,null,0,null,null,0,null,null,0,null,null,0,null,null,0,null,null,0,null,null,null,0,null,null,null,{"$f":"IF(AG410<Instructions!D439,AG410,SUM(AG410:AI410))","v":0},null,null,null,{"$f":"IF(AK410<Instructions!D438,AK410,SUM(AK410:AM410))","v":0},null,null,null,{"$f":"IF(AO410<Instructions!D437,AO410,SUM(AO410:AQ410))","v":0},null,null,{"$f":"SUM(Table_2[[#This Row],[Column20]],Table_2[[#This Row],[Column19]],Table_2[[#This Row],[Column18]])","v":0},"HEALTH & PHY. EDU.",null,null,null,null,null,null,null,null,null,0,null,null,null,null,null,null,null,null,null,null,null,null,null,"E",null,null,null,null,{"$f":"Table_2[[#This Row],[Column51]]&Table_2[[#This Row],[Column52]]&BU412","v":""}]
[null,null,null,null,null,null,null,null,null,null,null,null,0,null,null,0,null,null,0,null,null,0,null,null,0,null,null,0,null,null,null,0,null,null,null,{"$f":"IF(AG411<Instructions!D440,AG411,SUM(AG411:AI411))","v":0},null,null,null,{"$f":"IF(AK411<Instructions!D439,AK411,SUM(AK411:AM411))","v":0},null,null,null,{"$f":"IF(AO411<Instructions!D438,AO411,SUM(AO411:AQ411))","v":0},null,null,{"$f":"SUM(Table_2[[#This Row],[Column20]],Table_2[[#This Row],[Column19]],Table_2[[#This Row],[Column18]])","v":0},"HEALTH & PHY. EDU.",null,null,null,null,null,null,null,null,null,0,null,null,null,null,null,null,null,null,null,null,null,null,null,"E",null,null,null,null,{"$f":"Table_2[[#This Row],[Column51]]&Table_2[[#This Row],[Column52]]&BU413","v":""}]
[null,null,null,null,null,null,null,null,null,null,null,null,0,null,null,0,null,null,0,null,null,0,null,null,0,null,null,0,null,null,null,0,null,null,null,{"$f":"IF(AG412<Instructions!D441,AG412,SUM(AG412:AI412))","v":0},null,null,null,{"$f":"IF(AK412<Instructions!D440,AK412,SUM(AK412:AM412))","v":0},null,null,null,{"$f":"IF(AO412<Instructions!D439,AO412,SUM(AO412:AQ412))","v":0},null,null,{"$f":"SUM(Table_2[[#This Row],[Column20]],Table_2[[#This Row],[Column19]],Table_2[[#This Row],[Column18]])","v":0},"HEALTH & PHY. EDU.",null,null,null,null,null,null,null,null,null,0,null,null,null,null,null,null,null,null,null,null,null,null,null,"E",null,null,null,null,{"$f":"Table_2[[#This Row],[Column51]]&Table_2[[#This Row],[Column52]]&BU414","v":""}]
[null,null,null,null,null,null,null,null,null,null,null,null,0,null,null,0,null,null,0,null,null,0,null,null,0,null,null,0,null,null,null,0,null,null,null,{"$f":"IF(AG413<Instructions!D442,AG413,SUM(AG413:AI413))","v":0},null,null,null,{"$f":"IF(AK413<Instructions!D441,AK413,SUM(AK413:AM413))","v":0},null,null,null,{"$f":"IF(AO413<Instructions!D440,AO413,SUM(AO413:AQ413))","v":0},null,null,{"$f":"SUM(Table_2[[#This Row],[Column20]],Table_2[[#This Row],[Column19]],Table_2[[#This Row],[Column18]])","v":0},"HEALTH & PHY. EDU.",null,null,null,null,null,null,null,null,null,0,null,null,null,null,null,null,null,null,null,null,null,null,null,"E",null,null,null,null,{"$f":"Table_2[[#This Row],[Column51]]&Table_2[[#This Row],[Column52]]&BU415","v":""}]
[null,null,null,null,null,null,null,null,null,null,null,null,0,null,null,0,null,null,0,null,null,0,null,null,0,null,null,0,null,null,null,0,null,null,null,{"$f":"IF(AG414<Instructions!D443,AG414,SUM(AG414:AI414))","v":0},null,null,null,{"$f":"IF(AK414<Instructions!D442,AK414,SUM(AK414:AM414))","v":0},null,null,null,{"$f":"IF(AO414<Instructions!D441,AO414,SUM(AO414:AQ414))","v":0},null,null,{"$f":"SUM(Table_2[[#This Row],[Column20]],Table_2[[#This Row],[Column19]],Table_2[[#This Row],[Column18]])","v":0},"HEALTH & PHY. EDU.",null,null,null,null,null,null,null,null,null,0,null,null,null,null,null,null,null,null,null,null,null,null,null,"E",null,null,null,null,{"$f":"Table_2[[#This Row],[Column51]]&Table_2[[#This Row],[Column52]]&BU416","v":""}]
[null,null,null,null,null,null,null,null,null,null,null,null,0,null,null,0,null,null,0,null,null,0,null,null,0,null,null,0,null,null,null,0,null,null,null,{"$f":"IF(AG415<Instructions!D444,AG415,SUM(AG415:AI415))","v":0},null,null,null,{"$f":"IF(AK415<Instructions!D443,AK415,SUM(AK415:AM415))","v":0},null,null,null,{"$f":"IF(AO415<Instructions!D442,AO415,SUM(AO415:AQ415))","v":0},null,null,{"$f":"SUM(Table_2[[#This Row],[Column20]],Table_2[[#This Row],[Column19]],Table_2[[#This Row],[Column18]])","v":0},"HEALTH & PHY. EDU.",null,null,null,null,null,null,null,null,null,0,null,null,null,null,null,null,null,null,null,null,null,null,null,"E",null,null,null,null,{"$f":"Table_2[[#This Row],[Column51]]&Table_2[[#This Row],[Column52]]&BU417","v":""}]
[null,null,null,null,null,null,null,null,null,null,null,null,0,null,null,0,null,null,0,null,null,0,null,null,0,null,null,0,null,null,null,0,null,null,null,{"$f":"IF(AG416<Instructions!D445,AG416,SUM(AG416:AI416))","v":0},null,null,null,{"$f":"IF(AK416<Instructions!D444,AK416,SUM(AK416:AM416))","v":0},null,null,null,{"$f":"IF(AO416<Instructions!D443,AO416,SUM(AO416:AQ416))","v":0},null,null,{"$f":"SUM(Table_2[[#This Row],[Column20]],Table_2[[#This Row],[Column19]],Table_2[[#This Row],[Column18]])","v":0},"HEALTH & PHY. EDU.",null,null,null,null,null,null,null,null,null,0,null,null,null,null,null,null,null,null,null,null,null,null,null,"E",null,null,null,null,{"$f":"Table_2[[#This Row],[Column51]]&Table_2[[#This Row],[Column52]]&BU418","v":""}]
[null,null,null,null,null,null,null,null,null,null,null,null,0,null,null,0,null,null,0,null,null,0,null,null,0,null,null,0,null,null,null,0,null,null,null,{"$f":"IF(AG417<Instructions!D446,AG417,SUM(AG417:AI417))","v":0},null,null,null,{"$f":"IF(AK417<Instructions!D445,AK417,SUM(AK417:AM417))","v":0},null,null,null,{"$f":"IF(AO417<Instructions!D444,AO417,SUM(AO417:AQ417))","v":0},null,null,{"$f":"SUM(Table_2[[#This Row],[Column20]],Table_2[[#This Row],[Column19]],Table_2[[#This Row],[Column18]])","v":0},"HEALTH & PHY. EDU.",null,null,null,null,null,null,null,null,null,0,null,null,null,null,null,null,null,null,null,null,null,null,null,"E",null,null,null,null,{"$f":"Table_2[[#This Row],[Column51]]&Table_2[[#This Row],[Column52]]&BU419","v":""}]
[null,null,null,null,null,null,null,null,null,null,null,null,0,null,null,0,null,null,0,null,null,0,null,null,0,null,null,0,null,null,null,0,null,null,null,{"$f":"IF(AG418<Instructions!D447,AG418,SUM(AG418:AI418))","v":0},null,null,null,{"$f":"IF(AK418<Instructions!D446,AK418,SUM(AK418:AM418))","v":0},null,null,null,{"$f":"IF(AO418<Instructions!D445,AO418,SUM(AO418:AQ418))","v":0},null,null,{"$f":"SUM(Table_2[[#This Row],[Column20]],Table_2[[#This Row],[Column19]],Table_2[[#This Row],[Column18]])","v":0},"HEALTH & PHY. EDU.",null,null,null,null,null,null,null,null,null,0,null,null,null,null,null,null,null,null,null,null,null,null,null,"E",null,null,null,null,{"$f":"Table_2[[#This Row],[Column51]]&Table_2[[#This Row],[Column52]]&BU420","v":""}]
[null,null,null,null,null,null,null,null,null,null,null,null,0,null,null,0,null,null,0,null,null,0,null,null,0,null,null,0,null,null,null,0,null,null,null,{"$f":"IF(AG419<Instructions!D448,AG419,SUM(AG419:AI419))","v":0},null,null,null,{"$f":"IF(AK419<Instructions!D447,AK419,SUM(AK419:AM419))","v":0},null,null,null,{"$f":"IF(AO419<Instructions!D446,AO419,SUM(AO419:AQ419))","v":0},null,null,{"$f":"SUM(Table_2[[#This Row],[Column20]],Table_2[[#This Row],[Column19]],Table_2[[#This Row],[Column18]])","v":0},"HEALTH & PHY. EDU.",null,null,null,null,null,null,null,null,null,0,null,null,null,null,null,null,null,null,null,null,null,null,null,"E",null,null,null,null,{"$f":"Table_2[[#This Row],[Column51]]&Table_2[[#This Row],[Column52]]&BU421","v":""}]
[null,null,null,null,null,null,null,null,null,null,null,null,0,null,null,0,null,null,0,null,null,0,null,null,0,null,null,0,null,null,null,0,null,null,null,{"$f":"IF(AG420<Instructions!D449,AG420,SUM(AG420:AI420))","v":0},null,null,null,{"$f":"IF(AK420<Instructions!D448,AK420,SUM(AK420:AM420))","v":0},null,null,null,{"$f":"IF(AO420<Instructions!D447,AO420,SUM(AO420:AQ420))","v":0},null,null,{"$f":"SUM(Table_2[[#This Row],[Column20]],Table_2[[#This Row],[Column19]],Table_2[[#This Row],[Column18]])","v":0},"HEALTH & PHY. EDU.",null,null,null,null,null,null,null,null,null,0,null,null,null,null,null,null,null,null,null,null,null,null,null,"E",null,null,null,null,{"$f":"Table_2[[#This Row],[Column51]]&Table_2[[#This Row],[Column52]]&BU422","v":""}]
[null,null,null,null,null,null,null,null,null,null,null,null,0,null,null,0,null,null,0,null,null,0,null,null,0,null,null,0,null,null,null,0,null,null,null,{"$f":"IF(AG421<Instructions!D450,AG421,SUM(AG421:AI421))","v":0},null,null,null,{"$f":"IF(AK421<Instructions!D449,AK421,SUM(AK421:AM421))","v":0},null,null,null,{"$f":"IF(AO421<Instructions!D448,AO421,SUM(AO421:AQ421))","v":0},null,null,{"$f":"SUM(Table_2[[#This Row],[Column20]],Table_2[[#This Row],[Column19]],Table_2[[#This Row],[Column18]])","v":0},"HEALTH & PHY. EDU.",null,null,null,null,null,null,null,null,null,0,null,null,null,null,null,null,null,null,null,null,null,null,null,"E",null,null,null,null,{"$f":"Table_2[[#This Row],[Column51]]&Table_2[[#This Row],[Column52]]&BU423","v":""}]
[null,null,null,null,null,null,null,null,null,null,null,null,0,null,null,0,null,null,0,null,null,0,null,null,0,null,null,0,null,null,null,0,null,null,null,{"$f":"IF(AG422<Instructions!D451,AG422,SUM(AG422:AI422))","v":0},null,null,null,{"$f":"IF(AK422<Instructions!D450,AK422,SUM(AK422:AM422))","v":0},null,null,null,{"$f":"IF(AO422<Instructions!D449,AO422,SUM(AO422:AQ422))","v":0},null,null,{"$f":"SUM(Table_2[[#This Row],[Column20]],Table_2[[#This Row],[Column19]],Table_2[[#This Row],[Column18]])","v":0},"HEALTH & PHY. EDU.",null,null,null,null,null,null,null,null,null,0,null,null,null,null,null,null,null,null,null,null,null,null,null,"E",null,null,null,null,{"$f":"Table_2[[#This Row],[Column51]]&Table_2[[#This Row],[Column52]]&BU424","v":""}]
[null,null,null,null,null,null,null,null,null,null,null,null,0,null,null,0,null,null,0,null,null,0,null,null,0,null,null,0,null,null,null,0,null,null,null,{"$f":"IF(AG423<Instructions!D452,AG423,SUM(AG423:AI423))","v":0},null,null,null,{"$f":"IF(AK423<Instructions!D451,AK423,SUM(AK423:AM423))","v":0},null,null,null,{"$f":"IF(AO423<Instructions!D450,AO423,SUM(AO423:AQ423))","v":0},null,null,{"$f":"SUM(Table_2[[#This Row],[Column20]],Table_2[[#This Row],[Column19]],Table_2[[#This Row],[Column18]])","v":0},"HEALTH & PHY. EDU.",null,null,null,null,null,null,null,null,null,0,null,null,null,null,null,null,null,null,null,null,null,null,null,"E",null,null,null,null,{"$f":"Table_2[[#This Row],[Column51]]&Table_2[[#This Row],[Column52]]&BU425","v":""}]
[null,null,null,null,null,null,null,null,null,null,null,null,0,null,null,0,null,null,0,null,null,0,null,null,0,null,null,0,null,null,null,0,null,null,null,{"$f":"IF(AG424<Instructions!D453,AG424,SUM(AG424:AI424))","v":0},null,null,null,{"$f":"IF(AK424<Instructions!D452,AK424,SUM(AK424:AM424))","v":0},null,null,null,{"$f":"IF(AO424<Instructions!D451,AO424,SUM(AO424:AQ424))","v":0},null,null,{"$f":"SUM(Table_2[[#This Row],[Column20]],Table_2[[#This Row],[Column19]],Table_2[[#This Row],[Column18]])","v":0},"HEALTH & PHY. EDU.",null,null,null,null,null,null,null,null,null,0,null,null,null,null,null,null,null,null,null,null,null,null,null,"E",null,null,null,null,{"$f":"Table_2[[#This Row],[Column51]]&Table_2[[#This Row],[Column52]]&BU426","v":""}]
[null,null,null,null,null,null,null,null,null,null,null,null,0,null,null,0,null,null,0,null,null,0,null,null,0,null,null,0,null,null,null,0,null,null,null,{"$f":"IF(AG425<Instructions!D454,AG425,SUM(AG425:AI425))","v":0},null,null,null,{"$f":"IF(AK425<Instructions!D453,AK425,SUM(AK425:AM425))","v":0},null,null,null,{"$f":"IF(AO425<Instructions!D452,AO425,SUM(AO425:AQ425))","v":0},null,null,{"$f":"SUM(Table_2[[#This Row],[Column20]],Table_2[[#This Row],[Column19]],Table_2[[#This Row],[Column18]])","v":0},"HEALTH & PHY. EDU.",null,null,null,null,null,null,null,null,null,0,null,null,null,null,null,null,null,null,null,null,null,null,null,"E",null,null,null,null,{"$f":"Table_2[[#This Row],[Column51]]&Table_2[[#This Row],[Column52]]&BU427","v":""}]
[null,null,null,null,null,null,null,null,null,null,null,null,0,null,null,0,null,null,0,null,null,0,null,null,0,null,null,0,null,null,null,0,null,null,null,{"$f":"IF(AG426<Instructions!D455,AG426,SUM(AG426:AI426))","v":0},null,null,null,{"$f":"IF(AK426<Instructions!D454,AK426,SUM(AK426:AM426))","v":0},null,null,null,{"$f":"IF(AO426<Instructions!D453,AO426,SUM(AO426:AQ426))","v":0},null,null,{"$f":"SUM(Table_2[[#This Row],[Column20]],Table_2[[#This Row],[Column19]],Table_2[[#This Row],[Column18]])","v":0},"HEALTH & PHY. EDU.",null,null,null,null,null,null,null,null,null,0,null,null,null,null,null,null,null,null,null,null,null,null,null,"E",null,null,null,null,{"$f":"Table_2[[#This Row],[Column51]]&Table_2[[#This Row],[Column52]]&BU428","v":""}]
[null,null,null,null,null,null,null,null,null,null,null,null,0,null,null,0,null,null,0,null,null,0,null,null,0,null,null,0,null,null,null,0,null,null,null,{"$f":"IF(AG427<Instructions!D456,AG427,SUM(AG427:AI427))","v":0},null,null,null,{"$f":"IF(AK427<Instructions!D455,AK427,SUM(AK427:AM427))","v":0},null,null,null,{"$f":"IF(AO427<Instructions!D454,AO427,SUM(AO427:AQ427))","v":0},null,null,{"$f":"SUM(Table_2[[#This Row],[Column20]],Table_2[[#This Row],[Column19]],Table_2[[#This Row],[Column18]])","v":0},"HEALTH & PHY. EDU.",null,null,null,null,null,null,null,null,null,0,null,null,null,null,null,null,null,null,null,null,null,null,null,"E",null,null,null,null,{"$f":"Table_2[[#This Row],[Column51]]&Table_2[[#This Row],[Column52]]&BU429","v":""}]
[null,null,null,null,null,null,null,null,null,null,null,null,0,null,null,0,null,null,0,null,null,0,null,null,0,null,null,0,null,null,null,0,null,null,null,{"$f":"IF(AG428<Instructions!D457,AG428,SUM(AG428:AI428))","v":0},null,null,null,{"$f":"IF(AK428<Instructions!D456,AK428,SUM(AK428:AM428))","v":0},null,null,null,{"$f":"IF(AO428<Instructions!D455,AO428,SUM(AO428:AQ428))","v":0},null,null,{"$f":"SUM(Table_2[[#This Row],[Column20]],Table_2[[#This Row],[Column19]],Table_2[[#This Row],[Column18]])","v":0},"HEALTH & PHY. EDU.",null,null,null,null,null,null,null,null,null,0,null,null,null,null,null,null,null,null,null,null,null,null,null,"E",null,null,null,null,{"$f":"Table_2[[#This Row],[Column51]]&Table_2[[#This Row],[Column52]]&BU430","v":""}]
[null,null,null,null,null,null,null,null,null,null,null,null,0,null,null,0,null,null,0,null,null,0,null,null,0,null,null,0,null,null,null,0,null,null,null,{"$f":"IF(AG429<Instructions!D458,AG429,SUM(AG429:AI429))","v":0},null,null,null,{"$f":"IF(AK429<Instructions!D457,AK429,SUM(AK429:AM429))","v":0},null,null,null,{"$f":"IF(AO429<Instructions!D456,AO429,SUM(AO429:AQ429))","v":0},null,null,{"$f":"SUM(Table_2[[#This Row],[Column20]],Table_2[[#This Row],[Column19]],Table_2[[#This Row],[Column18]])","v":0},"HEALTH & PHY. EDU.",null,null,null,null,null,null,null,null,null,0,null,null,null,null,null,null,null,null,null,null,null,null,null,"E",null,null,null,null,{"$f":"Table_2[[#This Row],[Column51]]&Table_2[[#This Row],[Column52]]&BU431","v":""}]
[null,null,null,null,null,null,null,null,null,null,null,null,0,null,null,0,null,null,0,null,null,0,null,null,0,null,null,0,null,null,null,0,null,null,null,{"$f":"IF(AG430<Instructions!D459,AG430,SUM(AG430:AI430))","v":0},null,null,null,{"$f":"IF(AK430<Instructions!D458,AK430,SUM(AK430:AM430))","v":0},null,null,null,{"$f":"IF(AO430<Instructions!D457,AO430,SUM(AO430:AQ430))","v":0},null,null,{"$f":"SUM(Table_2[[#This Row],[Column20]],Table_2[[#This Row],[Column19]],Table_2[[#This Row],[Column18]])","v":0},"HEALTH & PHY. EDU.",null,null,null,null,null,null,null,null,null,0,null,null,null,null,null,null,null,null,null,null,null,null,null,"E",null,null,null,null,{"$f":"Table_2[[#This Row],[Column51]]&Table_2[[#This Row],[Column52]]&BU432","v":""}]
[null,null,null,null,null,null,null,null,null,null,null,null,0,null,null,0,null,null,0,null,null,0,null,null,0,null,null,0,null,null,null,0,null,null,null,{"$f":"IF(AG431<Instructions!D460,AG431,SUM(AG431:AI431))","v":0},null,null,null,{"$f":"IF(AK431<Instructions!D459,AK431,SUM(AK431:AM431))","v":0},null,null,null,{"$f":"IF(AO431<Instructions!D458,AO431,SUM(AO431:AQ431))","v":0},null,null,{"$f":"SUM(Table_2[[#This Row],[Column20]],Table_2[[#This Row],[Column19]],Table_2[[#This Row],[Column18]])","v":0},"HEALTH & PHY. EDU.",null,null,null,null,null,null,null,null,null,0,null,null,null,null,null,null,null,null,null,null,null,null,null,"E",null,null,null,null,{"$f":"Table_2[[#This Row],[Column51]]&Table_2[[#This Row],[Column52]]&BU433","v":""}]
[null,null,null,null,null,null,null,null,null,null,null,null,0,null,null,0,null,null,0,null,null,0,null,null,0,null,null,0,null,null,null,0,null,null,null,{"$f":"IF(AG432<Instructions!D461,AG432,SUM(AG432:AI432))","v":0},null,null,null,{"$f":"IF(AK432<Instructions!D460,AK432,SUM(AK432:AM432))","v":0},null,null,null,{"$f":"IF(AO432<Instructions!D459,AO432,SUM(AO432:AQ432))","v":0},null,null,{"$f":"SUM(Table_2[[#This Row],[Column20]],Table_2[[#This Row],[Column19]],Table_2[[#This Row],[Column18]])","v":0},"HEALTH & PHY. EDU.",null,null,null,null,null,null,null,null,null,0,null,null,null,null,null,null,null,null,null,null,null,null,null,"E",null,null,null,null,{"$f":"Table_2[[#This Row],[Column51]]&Table_2[[#This Row],[Column52]]&BU434","v":""}]
[null,null,null,null,null,null,null,null,null,null,null,null,0,null,null,0,null,null,0,null,null,0,null,null,0,null,null,0,null,null,null,0,null,null,null,{"$f":"IF(AG433<Instructions!D462,AG433,SUM(AG433:AI433))","v":0},null,null,null,{"$f":"IF(AK433<Instructions!D461,AK433,SUM(AK433:AM433))","v":0},null,null,null,{"$f":"IF(AO433<Instructions!D460,AO433,SUM(AO433:AQ433))","v":0},null,null,{"$f":"SUM(Table_2[[#This Row],[Column20]],Table_2[[#This Row],[Column19]],Table_2[[#This Row],[Column18]])","v":0},"HEALTH & PHY. EDU.",null,null,null,null,null,null,null,null,null,0,null,null,null,null,null,null,null,null,null,null,null,null,null,"E",null,null,null,null,{"$f":"Table_2[[#This Row],[Column51]]&Table_2[[#This Row],[Column52]]&BU435","v":""}]
[null,null,null,null,null,null,null,null,null,null,null,null,0,null,null,0,null,null,0,null,null,0,null,null,0,null,null,0,null,null,null,0,null,null,null,{"$f":"IF(AG434<Instructions!D463,AG434,SUM(AG434:AI434))","v":0},null,null,null,{"$f":"IF(AK434<Instructions!D462,AK434,SUM(AK434:AM434))","v":0},null,null,null,{"$f":"IF(AO434<Instructions!D461,AO434,SUM(AO434:AQ434))","v":0},null,null,{"$f":"SUM(Table_2[[#This Row],[Column20]],Table_2[[#This Row],[Column19]],Table_2[[#This Row],[Column18]])","v":0},"HEALTH & PHY. EDU.",null,null,null,null,null,null,null,null,null,0,null,null,null,null,null,null,null,null,null,null,null,null,null,"E",null,null,null,null,{"$f":"Table_2[[#This Row],[Column51]]&Table_2[[#This Row],[Column52]]&BU436","v":""}]
[null,null,null,null,null,null,null,null,null,null,null,null,0,null,null,0,null,null,0,null,null,0,null,null,0,null,null,0,null,null,null,0,null,null,null,{"$f":"IF(AG435<Instructions!D464,AG435,SUM(AG435:AI435))","v":0},null,null,null,{"$f":"IF(AK435<Instructions!D463,AK435,SUM(AK435:AM435))","v":0},null,null,null,{"$f":"IF(AO435<Instructions!D462,AO435,SUM(AO435:AQ435))","v":0},null,null,{"$f":"SUM(Table_2[[#This Row],[Column20]],Table_2[[#This Row],[Column19]],Table_2[[#This Row],[Column18]])","v":0},"HEALTH & PHY. EDU.",null,null,null,null,null,null,null,null,null,0,null,null,null,null,null,null,null,null,null,null,null,null,null,"E",null,null,null,null,{"$f":"Table_2[[#This Row],[Column51]]&Table_2[[#This Row],[Column52]]&BU437","v":""}]
[null,null,null,null,null,null,null,null,null,null,null,null,0,null,null,0,null,null,0,null,null,0,null,null,0,null,null,0,null,null,null,0,null,null,null,{"$f":"IF(AG436<Instructions!D465,AG436,SUM(AG436:AI436))","v":0},null,null,null,{"$f":"IF(AK436<Instructions!D464,AK436,SUM(AK436:AM436))","v":0},null,null,null,{"$f":"IF(AO436<Instructions!D463,AO436,SUM(AO436:AQ436))","v":0},null,null,{"$f":"SUM(Table_2[[#This Row],[Column20]],Table_2[[#This Row],[Column19]],Table_2[[#This Row],[Column18]])","v":0},"HEALTH & PHY. EDU.",null,null,null,null,null,null,null,null,null,0,null,null,null,null,null,null,null,null,null,null,null,null,null,"E",null,null,null,null,{"$f":"Table_2[[#This Row],[Column51]]&Table_2[[#This Row],[Column52]]&BU438","v":""}]
[null,null,null,null,null,null,null,null,null,null,null,null,0,null,null,0,null,null,0,null,null,0,null,null,0,null,null,0,null,null,null,0,null,null,null,{"$f":"IF(AG437<Instructions!D466,AG437,SUM(AG437:AI437))","v":0},null,null,null,{"$f":"IF(AK437<Instructions!D465,AK437,SUM(AK437:AM437))","v":0},null,null,null,{"$f":"IF(AO437<Instructions!D464,AO437,SUM(AO437:AQ437))","v":0},null,null,{"$f":"SUM(Table_2[[#This Row],[Column20]],Table_2[[#This Row],[Column19]],Table_2[[#This Row],[Column18]])","v":0},"HEALTH & PHY. EDU.",null,null,null,null,null,null,null,null,null,0,null,null,null,null,null,null,null,null,null,null,null,null,null,"E",null,null,null,null,{"$f":"Table_2[[#This Row],[Column51]]&Table_2[[#This Row],[Column52]]&BU439","v":""}]
[null,null,null,null,null,null,null,null,null,null,null,null,0,null,null,0,null,null,0,null,null,0,null,null,0,null,null,0,null,null,null,0,null,null,null,{"$f":"IF(AG438<Instructions!D467,AG438,SUM(AG438:AI438))","v":0},null,null,null,{"$f":"IF(AK438<Instructions!D466,AK438,SUM(AK438:AM438))","v":0},null,null,null,{"$f":"IF(AO438<Instructions!D465,AO438,SUM(AO438:AQ438))","v":0},null,null,{"$f":"SUM(Table_2[[#This Row],[Column20]],Table_2[[#This Row],[Column19]],Table_2[[#This Row],[Column18]])","v":0},"HEALTH & PHY. EDU.",null,null,null,null,null,null,null,null,null,0,null,null,null,null,null,null,null,null,null,null,null,null,null,"E",null,null,null,null,{"$f":"Table_2[[#This Row],[Column51]]&Table_2[[#This Row],[Column52]]&BU440","v":""}]
[null,null,null,null,null,null,null,null,null,null,null,null,0,null,null,0,null,null,0,null,null,0,null,null,0,null,null,0,null,null,null,0,null,null,null,{"$f":"IF(AG439<Instructions!D468,AG439,SUM(AG439:AI439))","v":0},null,null,null,{"$f":"IF(AK439<Instructions!D467,AK439,SUM(AK439:AM439))","v":0},null,null,null,{"$f":"IF(AO439<Instructions!D466,AO439,SUM(AO439:AQ439))","v":0},null,null,{"$f":"SUM(Table_2[[#This Row],[Column20]],Table_2[[#This Row],[Column19]],Table_2[[#This Row],[Column18]])","v":0},"HEALTH & PHY. EDU.",null,null,null,null,null,null,null,null,null,0,null,null,null,null,null,null,null,null,null,null,null,null,null,"E",null,null,null,null,{"$f":"Table_2[[#This Row],[Column51]]&Table_2[[#This Row],[Column52]]&BU441","v":""}]
[null,null,null,null,null,null,null,null,null,null,null,null,0,null,null,0,null,null,0,null,null,0,null,null,0,null,null,0,null,null,null,0,null,null,null,{"$f":"IF(AG440<Instructions!D469,AG440,SUM(AG440:AI440))","v":0},null,null,null,{"$f":"IF(AK440<Instructions!D468,AK440,SUM(AK440:AM440))","v":0},null,null,null,{"$f":"IF(AO440<Instructions!D467,AO440,SUM(AO440:AQ440))","v":0},null,null,{"$f":"SUM(Table_2[[#This Row],[Column20]],Table_2[[#This Row],[Column19]],Table_2[[#This Row],[Column18]])","v":0},"HEALTH & PHY. EDU.",null,null,null,null,null,null,null,null,null,0,null,null,null,null,null,null,null,null,null,null,null,null,null,"E",null,null,null,null,{"$f":"Table_2[[#This Row],[Column51]]&Table_2[[#This Row],[Column52]]&BU442","v":""}]
[null,null,null,null,null,null,null,null,null,null,null,null,0,null,null,0,null,null,0,null,null,0,null,null,0,null,null,0,null,null,null,0,null,null,null,{"$f":"IF(AG441<Instructions!D470,AG441,SUM(AG441:AI441))","v":0},null,null,null,{"$f":"IF(AK441<Instructions!D469,AK441,SUM(AK441:AM441))","v":0},null,null,null,{"$f":"IF(AO441<Instructions!D468,AO441,SUM(AO441:AQ441))","v":0},null,null,{"$f":"SUM(Table_2[[#This Row],[Column20]],Table_2[[#This Row],[Column19]],Table_2[[#This Row],[Column18]])","v":0},"HEALTH & PHY. EDU.",null,null,null,null,null,null,null,null,null,0,null,null,null,null,null,null,null,null,null,null,null,null,null,"E",null,null,null,null,{"$f":"Table_2[[#This Row],[Column51]]&Table_2[[#This Row],[Column52]]&BU443","v":""}]
[null,null,null,null,null,null,null,null,null,null,null,null,0,null,null,0,null,null,0,null,null,0,null,null,0,null,null,0,null,null,null,0,null,null,null,{"$f":"IF(AG442<Instructions!D471,AG442,SUM(AG442:AI442))","v":0},null,null,null,{"$f":"IF(AK442<Instructions!D470,AK442,SUM(AK442:AM442))","v":0},null,null,null,{"$f":"IF(AO442<Instructions!D469,AO442,SUM(AO442:AQ442))","v":0},null,null,{"$f":"SUM(Table_2[[#This Row],[Column20]],Table_2[[#This Row],[Column19]],Table_2[[#This Row],[Column18]])","v":0},"HEALTH & PHY. EDU.",null,null,null,null,null,null,null,null,null,0,null,null,null,null,null,null,null,null,null,null,null,null,null,"E",null,null,null,null,{"$f":"Table_2[[#This Row],[Column51]]&Table_2[[#This Row],[Column52]]&BU444","v":""}]
[null,null,null,null,null,null,null,null,null,null,null,null,0,null,null,0,null,null,0,null,null,0,null,null,0,null,null,0,null,null,null,0,null,null,null,{"$f":"IF(AG443<Instructions!D472,AG443,SUM(AG443:AI443))","v":0},null,null,null,{"$f":"IF(AK443<Instructions!D471,AK443,SUM(AK443:AM443))","v":0},null,null,null,{"$f":"IF(AO443<Instructions!D470,AO443,SUM(AO443:AQ443))","v":0},null,null,{"$f":"SUM(Table_2[[#This Row],[Column20]],Table_2[[#This Row],[Column19]],Table_2[[#This Row],[Column18]])","v":0},"HEALTH & PHY. EDU.",null,null,null,null,null,null,null,null,null,0,null,null,null,null,null,null,null,null,null,null,null,null,null,"E",null,null,null,null,{"$f":"Table_2[[#This Row],[Column51]]&Table_2[[#This Row],[Column52]]&BU445","v":""}]
[null,null,null,null,null,null,null,null,null,null,null,null,0,null,null,0,null,null,0,null,null,0,null,null,0,null,null,0,null,null,null,0,null,null,null,{"$f":"IF(AG444<Instructions!D473,AG444,SUM(AG444:AI444))","v":0},null,null,null,{"$f":"IF(AK444<Instructions!D472,AK444,SUM(AK444:AM444))","v":0},null,null,null,{"$f":"IF(AO444<Instructions!D471,AO444,SUM(AO444:AQ444))","v":0},null,null,{"$f":"SUM(Table_2[[#This Row],[Column20]],Table_2[[#This Row],[Column19]],Table_2[[#This Row],[Column18]])","v":0},"HEALTH & PHY. EDU.",null,null,null,null,null,null,null,null,null,0,null,null,null,null,null,null,null,null,null,null,null,null,null,"E",null,null,null,null,{"$f":"Table_2[[#This Row],[Column51]]&Table_2[[#This Row],[Column52]]&BU446","v":""}]
[null,null,null,null,null,null,null,null,null,null,null,null,0,null,null,0,null,null,0,null,null,0,null,null,0,null,null,0,null,null,null,0,null,null,null,{"$f":"IF(AG445<Instructions!D474,AG445,SUM(AG445:AI445))","v":0},null,null,null,{"$f":"IF(AK445<Instructions!D473,AK445,SUM(AK445:AM445))","v":0},null,null,null,{"$f":"IF(AO445<Instructions!D472,AO445,SUM(AO445:AQ445))","v":0},null,null,{"$f":"SUM(Table_2[[#This Row],[Column20]],Table_2[[#This Row],[Column19]],Table_2[[#This Row],[Column18]])","v":0},"HEALTH & PHY. EDU.",null,null,null,null,null,null,null,null,null,0,null,null,null,null,null,null,null,null,null,null,null,null,null,"E",null,null,null,null,{"$f":"Table_2[[#This Row],[Column51]]&Table_2[[#This Row],[Column52]]&BU447","v":""}]
[null,null,null,null,null,null,null,null,null,null,null,null,0,null,null,0,null,null,0,null,null,0,null,null,0,null,null,0,null,null,null,0,null,null,null,{"$f":"IF(AG446<Instructions!D475,AG446,SUM(AG446:AI446))","v":0},null,null,null,{"$f":"IF(AK446<Instructions!D474,AK446,SUM(AK446:AM446))","v":0},null,null,null,{"$f":"IF(AO446<Instructions!D473,AO446,SUM(AO446:AQ446))","v":0},null,null,{"$f":"SUM(Table_2[[#This Row],[Column20]],Table_2[[#This Row],[Column19]],Table_2[[#This Row],[Column18]])","v":0},"HEALTH & PHY. EDU.",null,null,null,null,null,null,null,null,null,0,null,null,null,null,null,null,null,null,null,null,null,null,null,"E",null,null,null,null,{"$f":"Table_2[[#This Row],[Column51]]&Table_2[[#This Row],[Column52]]&BU448","v":""}]
[null,null,null,null,null,null,null,null,null,null,null,null,0,null,null,0,null,null,0,null,null,0,null,null,0,null,null,0,null,null,null,0,null,null,null,{"$f":"IF(AG447<Instructions!D476,AG447,SUM(AG447:AI447))","v":0},null,null,null,{"$f":"IF(AK447<Instructions!D475,AK447,SUM(AK447:AM447))","v":0},null,null,null,{"$f":"IF(AO447<Instructions!D474,AO447,SUM(AO447:AQ447))","v":0},null,null,{"$f":"SUM(Table_2[[#This Row],[Column20]],Table_2[[#This Row],[Column19]],Table_2[[#This Row],[Column18]])","v":0},"HEALTH & PHY. EDU.",null,null,null,null,null,null,null,null,null,0,null,null,null,null,null,null,null,null,null,null,null,null,null,"E",null,null,null,null,{"$f":"Table_2[[#This Row],[Column51]]&Table_2[[#This Row],[Column52]]&BU449","v":""}]
[null,null,null,null,null,null,null,null,null,null,null,null,0,null,null,0,null,null,0,null,null,0,null,null,0,null,null,0,null,null,null,0,null,null,null,{"$f":"IF(AG448<Instructions!D477,AG448,SUM(AG448:AI448))","v":0},null,null,null,{"$f":"IF(AK448<Instructions!D476,AK448,SUM(AK448:AM448))","v":0},null,null,null,{"$f":"IF(AO448<Instructions!D475,AO448,SUM(AO448:AQ448))","v":0},null,null,{"$f":"SUM(Table_2[[#This Row],[Column20]],Table_2[[#This Row],[Column19]],Table_2[[#This Row],[Column18]])","v":0},"HEALTH & PHY. EDU.",null,null,null,null,null,null,null,null,null,0,null,null,null,null,null,null,null,null,null,null,null,null,null,"E",null,null,null,null,{"$f":"Table_2[[#This Row],[Column51]]&Table_2[[#This Row],[Column52]]&BU450","v":""}]
[null,null,null,null,null,null,null,null,null,null,null,null,0,null,null,0,null,null,0,null,null,0,null,null,0,null,null,0,null,null,null,0,null,null,null,{"$f":"IF(AG449<Instructions!D478,AG449,SUM(AG449:AI449))","v":0},null,null,null,{"$f":"IF(AK449<Instructions!D477,AK449,SUM(AK449:AM449))","v":0},null,null,null,{"$f":"IF(AO449<Instructions!D476,AO449,SUM(AO449:AQ449))","v":0},null,null,{"$f":"SUM(Table_2[[#This Row],[Column20]],Table_2[[#This Row],[Column19]],Table_2[[#This Row],[Column18]])","v":0},"HEALTH & PHY. EDU.",null,null,null,null,null,null,null,null,null,0,null,null,null,null,null,null,null,null,null,null,null,null,null,"E",null,null,null,null,{"$f":"Table_2[[#This Row],[Column51]]&Table_2[[#This Row],[Column52]]&BU451","v":""}]
[null,null,null,null,null,null,null,null,null,null,null,null,0,null,null,0,null,null,0,null,null,0,null,null,0,null,null,0,null,null,null,0,null,null,null,{"$f":"IF(AG450<Instructions!D479,AG450,SUM(AG450:AI450))","v":0},null,null,null,{"$f":"IF(AK450<Instructions!D478,AK450,SUM(AK450:AM450))","v":0},null,null,null,{"$f":"IF(AO450<Instructions!D477,AO450,SUM(AO450:AQ450))","v":0},null,null,{"$f":"SUM(Table_2[[#This Row],[Column20]],Table_2[[#This Row],[Column19]],Table_2[[#This Row],[Column18]])","v":0},"HEALTH & PHY. EDU.",null,null,null,null,null,null,null,null,null,0,null,null,null,null,null,null,null,null,null,null,null,null,null,"E",null,null,null,null,{"$f":"Table_2[[#This Row],[Column51]]&Table_2[[#This Row],[Column52]]&BU452","v":""}]
[null,null,null,null,null,null,null,null,null,null,null,null,0,null,null,0,null,null,0,null,null,0,null,null,0,null,null,0,null,null,null,0,null,null,null,{"$f":"IF(AG451<Instructions!D480,AG451,SUM(AG451:AI451))","v":0},null,null,null,{"$f":"IF(AK451<Instructions!D479,AK451,SUM(AK451:AM451))","v":0},null,null,null,{"$f":"IF(AO451<Instructions!D478,AO451,SUM(AO451:AQ451))","v":0},null,null,{"$f":"SUM(Table_2[[#This Row],[Column20]],Table_2[[#This Row],[Column19]],Table_2[[#This Row],[Column18]])","v":0},"HEALTH & PHY. EDU.",null,null,null,null,null,null,null,null,null,0,null,null,null,null,null,null,null,null,null,null,null,null,null,"E",null,null,null,null,{"$f":"Table_2[[#This Row],[Column51]]&Table_2[[#This Row],[Column52]]&BU453","v":""}]
[null,null,null,null,null,null,null,null,null,null,null,null,{"$f":"IF(K452<33,K452,SUM(K452:L452))","v":0},null,null,{"$f":"IF(N452<20,N452,SUM(N452:O452))","v":0},null,null,{"$f":"IF(Q452<20,Q452,SUM(Q452:R452))","v":0},null,null,{"$f":"IF(T452<20,T452,SUM(T452:U452))","v":0},null,null,{"$f":"IF(W452<20,W452,SUM(W452:X452))","v":0},null,null,{"$f":"IF(Z452<20,Z452,SUM(Z452:AA452))","v":0},null,null,null,{"$f":"IF(AC452<10,AC452,SUM(AC452:AE452))","v":0},null,null,null,{"$f":"IF(AG452<Instructions!D481,AG452,SUM(AG452:AI452))","v":0},null,null,null,{"$f":"IF(AK452<Instructions!D480,AK452,SUM(AK452:AM452))","v":0},null,null,null,{"$f":"IF(AO452<Instructions!D479,AO452,SUM(AO452:AQ452))","v":0},null,null,{"$f":"SUM(Table_2[[#This Row],[Column20]],Table_2[[#This Row],[Column19]],Table_2[[#This Row],[Column18]])","v":0},{"$f":"IF(N(AJ452)>0,$AG$1,IF(N(AN452)>0,$AK$1,$AO$1))","v":"HEALTH & PHY. EDU."},null,null,null,null,null,null,null,null,null,{"$f":"(AU452/100)*100","v":0},null,null,null,null,null,null,null,null,null,null,null,null,null,{"$f":"IFERROR(IF(BF452>90,\"A+\",IF(BF452>80,\"A\",IF(BF452>70,\"B+\",IF(BF452>60,\"B\",IF(BF452>50,\"C+\",IF(BF452>40,\"C\",IF(BF452>=33,\"D\",\"E\"))))))),\"Abs\")","v":"E"},null,null,null,null,{"$f":"Table_2[[#This Row],[Column51]]&Table_2[[#This Row],[Column52]]&BU454","v":""}]
[null,null,null,null,null,null,null,null,null,null,null,null,0,null,null,0,null,null,0,null,null,0,null,null,0,null,null,0,null,null,null,0,null,null,null,{"$f":"IF(AG453<Instructions!D482,AG453,SUM(AG453:AI453))","v":0},null,null,null,{"$f":"IF(AK453<Instructions!D481,AK453,SUM(AK453:AM453))","v":0},null,null,null,{"$f":"IF(AO453<Instructions!D480,AO453,SUM(AO453:AQ453))","v":0},null,null,{"$f":"SUM(Table_2[[#This Row],[Column20]],Table_2[[#This Row],[Column19]],Table_2[[#This Row],[Column18]])","v":0},"HEALTH & PHY. EDU.",null,null,null,null,null,null,null,null,null,0,null,null,null,null,null,null,null,null,null,null,null,null,null,"E",null,null,null,null,{"$f":"Table_2[[#This Row],[Column51]]&Table_2[[#This Row],[Column52]]&BU455","v":""}]
[null,null,null,null,null,null,null,null,null,null,null,null,0,null,null,0,null,null,0,null,null,0,null,null,0,null,null,0,null,null,null,0,null,null,null,{"$f":"IF(AG454<Instructions!D483,AG454,SUM(AG454:AI454))","v":0},null,null,null,{"$f":"IF(AK454<Instructions!D482,AK454,SUM(AK454:AM454))","v":0},null,null,null,{"$f":"IF(AO454<Instructions!D481,AO454,SUM(AO454:AQ454))","v":0},null,null,{"$f":"SUM(Table_2[[#This Row],[Column20]],Table_2[[#This Row],[Column19]],Table_2[[#This Row],[Column18]])","v":0},"HEALTH & PHY. EDU.",null,null,null,null,null,null,null,null,null,0,null,null,null,null,null,null,null,null,null,null,null,null,null,"E",null,null,null,null,{"$f":"Table_2[[#This Row],[Column51]]&Table_2[[#This Row],[Column52]]&BU456","v":""}]
[null,null,null,null,null,null,null,null,null,null,null,null,0,null,null,0,null,null,0,null,null,0,null,null,0,null,null,0,null,null,null,0,null,null,null,{"$f":"IF(AG455<Instructions!D484,AG455,SUM(AG455:AI455))","v":0},null,null,null,{"$f":"IF(AK455<Instructions!D483,AK455,SUM(AK455:AM455))","v":0},null,null,null,{"$f":"IF(AO455<Instructions!D482,AO455,SUM(AO455:AQ455))","v":0},null,null,{"$f":"SUM(Table_2[[#This Row],[Column20]],Table_2[[#This Row],[Column19]],Table_2[[#This Row],[Column18]])","v":0},"HEALTH & PHY. EDU.",null,null,null,null,null,null,null,null,null,0,null,null,null,null,null,null,null,null,null,null,null,null,null,"E",null,null,null,null,{"$f":"Table_2[[#This Row],[Column51]]&Table_2[[#This Row],[Column52]]&BU457","v":""}]
[null,null,null,null,null,null,null,null,null,null,null,null,0,null,null,0,null,null,0,null,null,0,null,null,0,null,null,0,null,null,null,0,null,null,null,{"$f":"IF(AG456<Instructions!D485,AG456,SUM(AG456:AI456))","v":0},null,null,null,{"$f":"IF(AK456<Instructions!D484,AK456,SUM(AK456:AM456))","v":0},null,null,null,{"$f":"IF(AO456<Instructions!D483,AO456,SUM(AO456:AQ456))","v":0},null,null,{"$f":"SUM(Table_2[[#This Row],[Column20]],Table_2[[#This Row],[Column19]],Table_2[[#This Row],[Column18]])","v":0},"HEALTH & PHY. EDU.",null,null,null,null,null,null,null,null,null,0,null,null,null,null,null,null,null,null,null,null,null,null,null,"E",null,null,null,null,{"$f":"Table_2[[#This Row],[Column51]]&Table_2[[#This Row],[Column52]]&BU458","v":""}]
[null,null,null,null,null,null,null,null,null,null,null,null,0,null,null,0,null,null,0,null,null,0,null,null,0,null,null,0,null,null,null,0,null,null,null,{"$f":"IF(AG457<Instructions!D486,AG457,SUM(AG457:AI457))","v":0},null,null,null,{"$f":"IF(AK457<Instructions!D485,AK457,SUM(AK457:AM457))","v":0},null,null,null,{"$f":"IF(AO457<Instructions!D484,AO457,SUM(AO457:AQ457))","v":0},null,null,{"$f":"SUM(Table_2[[#This Row],[Column20]],Table_2[[#This Row],[Column19]],Table_2[[#This Row],[Column18]])","v":0},"HEALTH & PHY. EDU.",null,null,null,null,null,null,null,null,null,0,null,null,null,null,null,null,null,null,null,null,null,null,null,"E",null,null,null,null,{"$f":"Table_2[[#This Row],[Column51]]&Table_2[[#This Row],[Column52]]&BU459","v":""}]
[null,null,null,null,null,null,null,null,null,null,null,null,0,null,null,0,null,null,0,null,null,0,null,null,0,null,null,0,null,null,null,0,null,null,null,{"$f":"IF(AG458<Instructions!D487,AG458,SUM(AG458:AI458))","v":0},null,null,null,{"$f":"IF(AK458<Instructions!D486,AK458,SUM(AK458:AM458))","v":0},null,null,null,{"$f":"IF(AO458<Instructions!D485,AO458,SUM(AO458:AQ458))","v":0},null,null,{"$f":"SUM(Table_2[[#This Row],[Column20]],Table_2[[#This Row],[Column19]],Table_2[[#This Row],[Column18]])","v":0},"HEALTH & PHY. EDU.",null,null,null,null,null,null,null,null,null,0,null,null,null,null,null,null,null,null,null,null,null,null,null,"E",null,null,null,null,{"$f":"Table_2[[#This Row],[Column51]]&Table_2[[#This Row],[Column52]]&BU460","v":""}]
[null,null,null,null,null,null,null,null,null,null,null,null,0,null,null,0,null,null,0,null,null,0,null,null,0,null,null,0,null,null,null,0,null,null,null,{"$f":"IF(AG459<Instructions!D488,AG459,SUM(AG459:AI459))","v":0},null,null,null,{"$f":"IF(AK459<Instructions!D487,AK459,SUM(AK459:AM459))","v":0},null,null,null,{"$f":"IF(AO459<Instructions!D486,AO459,SUM(AO459:AQ459))","v":0},null,null,{"$f":"SUM(Table_2[[#This Row],[Column20]],Table_2[[#This Row],[Column19]],Table_2[[#This Row],[Column18]])","v":0},"HEALTH & PHY. EDU.",null,null,null,null,null,null,null,null,null,0,null,null,null,null,null,null,null,null,null,null,null,null,null,"E",null,null,null,null,{"$f":"Table_2[[#This Row],[Column51]]&Table_2[[#This Row],[Column52]]&BU461","v":""}]
[null,null,null,null,null,null,null,null,null,null,null,null,0,null,null,0,null,null,0,null,null,0,null,null,0,null,null,0,null,null,null,0,null,null,null,{"$f":"IF(AG460<Instructions!D489,AG460,SUM(AG460:AI460))","v":0},null,null,null,{"$f":"IF(AK460<Instructions!D488,AK460,SUM(AK460:AM460))","v":0},null,null,null,{"$f":"IF(AO460<Instructions!D487,AO460,SUM(AO460:AQ460))","v":0},null,null,{"$f":"SUM(Table_2[[#This Row],[Column20]],Table_2[[#This Row],[Column19]],Table_2[[#This Row],[Column18]])","v":0},"HEALTH & PHY. EDU.",null,null,null,null,null,null,null,null,null,0,null,null,null,null,null,null,null,null,null,null,null,null,null,"E",null,null,null,null,{"$f":"Table_2[[#This Row],[Column51]]&Table_2[[#This Row],[Column52]]&BU462","v":""}]
[null,null,null,null,null,null,null,null,null,null,null,null,0,null,null,0,null,null,0,null,null,0,null,null,0,null,null,0,null,null,null,0,null,null,null,{"$f":"IF(AG461<Instructions!D490,AG461,SUM(AG461:AI461))","v":0},null,null,null,{"$f":"IF(AK461<Instructions!D489,AK461,SUM(AK461:AM461))","v":0},null,null,null,{"$f":"IF(AO461<Instructions!D488,AO461,SUM(AO461:AQ461))","v":0},null,null,{"$f":"SUM(Table_2[[#This Row],[Column20]],Table_2[[#This Row],[Column19]],Table_2[[#This Row],[Column18]])","v":0},"HEALTH & PHY. EDU.",null,null,null,null,null,null,null,null,null,0,null,null,null,null,null,null,null,null,null,null,null,null,null,"E",null,null,null,null,{"$f":"Table_2[[#This Row],[Column51]]&Table_2[[#This Row],[Column52]]&BU463","v":""}]
[null,null,null,null,null,null,null,null,null,null,null,null,0,null,null,0,null,null,0,null,null,0,null,null,0,null,null,0,null,null,null,0,null,null,null,{"$f":"IF(AG462<Instructions!D491,AG462,SUM(AG462:AI462))","v":0},null,null,null,{"$f":"IF(AK462<Instructions!D490,AK462,SUM(AK462:AM462))","v":0},null,null,null,{"$f":"IF(AO462<Instructions!D489,AO462,SUM(AO462:AQ462))","v":0},null,null,{"$f":"SUM(Table_2[[#This Row],[Column20]],Table_2[[#This Row],[Column19]],Table_2[[#This Row],[Column18]])","v":0},"HEALTH & PHY. EDU.",null,null,null,null,null,null,null,null,null,0,null,null,null,null,null,null,null,null,null,null,null,null,null,"E",null,null,null,null,{"$f":"Table_2[[#This Row],[Column51]]&Table_2[[#This Row],[Column52]]&BU464","v":""}]
[null,null,null,null,null,null,null,null,null,null,null,null,0,null,null,0,null,null,0,null,null,0,null,null,0,null,null,0,null,null,null,0,null,null,null,{"$f":"IF(AG463<Instructions!D492,AG463,SUM(AG463:AI463))","v":0},null,null,null,{"$f":"IF(AK463<Instructions!D491,AK463,SUM(AK463:AM463))","v":0},null,null,null,{"$f":"IF(AO463<Instructions!D490,AO463,SUM(AO463:AQ463))","v":0},null,null,{"$f":"SUM(Table_2[[#This Row],[Column20]],Table_2[[#This Row],[Column19]],Table_2[[#This Row],[Column18]])","v":0},"HEALTH & PHY. EDU.",null,null,null,null,null,null,null,null,null,0,null,null,null,null,null,null,null,null,null,null,null,null,null,"E",null,null,null,null,{"$f":"Table_2[[#This Row],[Column51]]&Table_2[[#This Row],[Column52]]&BU465","v":""}]
[null,null,null,null,null,null,null,null,null,null,null,null,0,null,null,0,null,null,0,null,null,0,null,null,0,null,null,0,null,null,null,0,null,null,null,{"$f":"IF(AG464<Instructions!D493,AG464,SUM(AG464:AI464))","v":0},null,null,null,{"$f":"IF(AK464<Instructions!D492,AK464,SUM(AK464:AM464))","v":0},null,null,null,{"$f":"IF(AO464<Instructions!D491,AO464,SUM(AO464:AQ464))","v":0},null,null,{"$f":"SUM(Table_2[[#This Row],[Column20]],Table_2[[#This Row],[Column19]],Table_2[[#This Row],[Column18]])","v":0},"HEALTH & PHY. EDU.",null,null,null,null,null,null,null,null,null,0,null,null,null,null,null,null,null,null,null,null,null,null,null,"E",null,null,null,null,{"$f":"Table_2[[#This Row],[Column51]]&Table_2[[#This Row],[Column52]]&BU466","v":""}]
[null,null,null,null,null,null,null,null,null,null,null,null,0,null,null,0,null,null,0,null,null,0,null,null,0,null,null,0,null,null,null,0,null,null,null,{"$f":"IF(AG465<Instructions!D494,AG465,SUM(AG465:AI465))","v":0},null,null,null,{"$f":"IF(AK465<Instructions!D493,AK465,SUM(AK465:AM465))","v":0},null,null,null,{"$f":"IF(AO465<Instructions!D492,AO465,SUM(AO465:AQ465))","v":0},null,null,{"$f":"SUM(Table_2[[#This Row],[Column20]],Table_2[[#This Row],[Column19]],Table_2[[#This Row],[Column18]])","v":0},"HEALTH & PHY. EDU.",null,null,null,null,null,null,null,null,null,0,null,null,null,null,null,null,null,null,null,null,null,null,null,"E",null,null,null,null,{"$f":"Table_2[[#This Row],[Column51]]&Table_2[[#This Row],[Column52]]&BU467","v":""}]
[null,null,null,null,null,null,null,null,null,null,null,null,0,null,null,0,null,null,0,null,null,0,null,null,0,null,null,0,null,null,null,0,null,null,null,{"$f":"IF(AG466<Instructions!D495,AG466,SUM(AG466:AI466))","v":0},null,null,null,{"$f":"IF(AK466<Instructions!D494,AK466,SUM(AK466:AM466))","v":0},null,null,null,{"$f":"IF(AO466<Instructions!D493,AO466,SUM(AO466:AQ466))","v":0},null,null,{"$f":"SUM(Table_2[[#This Row],[Column20]],Table_2[[#This Row],[Column19]],Table_2[[#This Row],[Column18]])","v":0},"HEALTH & PHY. EDU.",null,null,null,null,null,null,null,null,null,0,null,null,null,null,null,null,null,null,null,null,null,null,null,"E",null,null,null,null,{"$f":"Table_2[[#This Row],[Column51]]&Table_2[[#This Row],[Column52]]&BU468","v":""}]
[null,null,null,null,null,null,null,null,null,null,null,null,0,null,null,0,null,null,0,null,null,0,null,null,0,null,null,0,null,null,null,0,null,null,null,{"$f":"IF(AG467<Instructions!D496,AG467,SUM(AG467:AI467))","v":0},null,null,null,{"$f":"IF(AK467<Instructions!D495,AK467,SUM(AK467:AM467))","v":0},null,null,null,{"$f":"IF(AO467<Instructions!D494,AO467,SUM(AO467:AQ467))","v":0},null,null,{"$f":"SUM(Table_2[[#This Row],[Column20]],Table_2[[#This Row],[Column19]],Table_2[[#This Row],[Column18]])","v":0},"HEALTH & PHY. EDU.",null,null,null,null,null,null,null,null,null,0,null,null,null,null,null,null,null,null,null,null,null,null,null,"E",null,null,null,null,{"$f":"Table_2[[#This Row],[Column51]]&Table_2[[#This Row],[Column52]]&BU469","v":""}]
[null,null,null,null,null,null,null,null,null,null,null,null,0,null,null,0,null,null,0,null,null,0,null,null,0,null,null,0,null,null,null,0,null,null,null,{"$f":"IF(AG468<Instructions!D497,AG468,SUM(AG468:AI468))","v":0},null,null,null,{"$f":"IF(AK468<Instructions!D496,AK468,SUM(AK468:AM468))","v":0},null,null,null,{"$f":"IF(AO468<Instructions!D495,AO468,SUM(AO468:AQ468))","v":0},null,null,{"$f":"SUM(Table_2[[#This Row],[Column20]],Table_2[[#This Row],[Column19]],Table_2[[#This Row],[Column18]])","v":0},"HEALTH & PHY. EDU.",null,null,null,null,null,null,null,null,null,0,null,null,null,null,null,null,null,null,null,null,null,null,null,"E",null,null,null,null,{"$f":"Table_2[[#This Row],[Column51]]&Table_2[[#This Row],[Column52]]&BU470","v":""}]
[null,null,null,null,null,null,null,null,null,null,null,null,0,null,null,0,null,null,0,null,null,0,null,null,0,null,null,0,null,null,null,0,null,null,null,{"$f":"IF(AG469<Instructions!D498,AG469,SUM(AG469:AI469))","v":0},null,null,null,{"$f":"IF(AK469<Instructions!D497,AK469,SUM(AK469:AM469))","v":0},null,null,null,{"$f":"IF(AO469<Instructions!D496,AO469,SUM(AO469:AQ469))","v":0},null,null,{"$f":"SUM(Table_2[[#This Row],[Column20]],Table_2[[#This Row],[Column19]],Table_2[[#This Row],[Column18]])","v":0},"HEALTH & PHY. EDU.",null,null,null,null,null,null,null,null,null,0,null,null,null,null,null,null,null,null,null,null,null,null,null,"E",null,null,null,null,{"$f":"Table_2[[#This Row],[Column51]]&Table_2[[#This Row],[Column52]]&BU471","v":""}]
[null,null,null,null,null,null,null,null,null,null,null,null,0,null,null,0,null,null,0,null,null,0,null,null,0,null,null,0,null,null,null,0,null,null,null,{"$f":"IF(AG470<Instructions!D499,AG470,SUM(AG470:AI470))","v":0},null,null,null,{"$f":"IF(AK470<Instructions!D498,AK470,SUM(AK470:AM470))","v":0},null,null,null,{"$f":"IF(AO470<Instructions!D497,AO470,SUM(AO470:AQ470))","v":0},null,null,{"$f":"SUM(Table_2[[#This Row],[Column20]],Table_2[[#This Row],[Column19]],Table_2[[#This Row],[Column18]])","v":0},"HEALTH & PHY. EDU.",null,null,null,null,null,null,null,null,null,0,null,null,null,null,null,null,null,null,null,null,null,null,null,"E",null,null,null,null,{"$f":"Table_2[[#This Row],[Column51]]&Table_2[[#This Row],[Column52]]&BU472","v":""}]
[null,null,null,null,null,null,null,null,null,null,null,null,0,null,null,0,null,null,0,null,null,0,null,null,0,null,null,0,null,null,null,0,null,null,null,{"$f":"IF(AG471<Instructions!D500,AG471,SUM(AG471:AI471))","v":0},null,null,null,{"$f":"IF(AK471<Instructions!D499,AK471,SUM(AK471:AM471))","v":0},null,null,null,{"$f":"IF(AO471<Instructions!D498,AO471,SUM(AO471:AQ471))","v":0},null,null,{"$f":"SUM(Table_2[[#This Row],[Column20]],Table_2[[#This Row],[Column19]],Table_2[[#This Row],[Column18]])","v":0},"HEALTH & PHY. EDU.",null,null,null,null,null,null,null,null,null,0,null,null,null,null,null,null,null,null,null,null,null,null,null,"E",null,null,null,null,{"$f":"Table_2[[#This Row],[Column51]]&Table_2[[#This Row],[Column52]]&BU473","v":""}]
[null,null,null,null,null,null,null,null,null,null,null,null,0,null,null,0,null,null,0,null,null,0,null,null,0,null,null,0,null,null,null,0,null,null,null,{"$f":"IF(AG472<Instructions!D501,AG472,SUM(AG472:AI472))","v":0},null,null,null,{"$f":"IF(AK472<Instructions!D500,AK472,SUM(AK472:AM472))","v":0},null,null,null,{"$f":"IF(AO472<Instructions!D499,AO472,SUM(AO472:AQ472))","v":0},null,null,{"$f":"SUM(Table_2[[#This Row],[Column20]],Table_2[[#This Row],[Column19]],Table_2[[#This Row],[Column18]])","v":0},"HEALTH & PHY. EDU.",null,null,null,null,null,null,null,null,null,0,null,null,null,null,null,null,null,null,null,null,null,null,null,"E",null,null,null,null,{"$f":"Table_2[[#This Row],[Column51]]&Table_2[[#This Row],[Column52]]&BU474","v":""}]
[null,null,null,null,null,null,null,null,null,null,null,null,0,null,null,0,null,null,0,null,null,0,null,null,0,null,null,0,null,null,null,0,null,null,null,{"$f":"IF(AG473<Instructions!D502,AG473,SUM(AG473:AI473))","v":0},null,null,null,{"$f":"IF(AK473<Instructions!D501,AK473,SUM(AK473:AM473))","v":0},null,null,null,{"$f":"IF(AO473<Instructions!D500,AO473,SUM(AO473:AQ473))","v":0},null,null,{"$f":"SUM(Table_2[[#This Row],[Column20]],Table_2[[#This Row],[Column19]],Table_2[[#This Row],[Column18]])","v":0},"HEALTH & PHY. EDU.",null,null,null,null,null,null,null,null,null,0,null,null,null,null,null,null,null,null,null,null,null,null,null,"E",null,null,null,null,{"$f":"Table_2[[#This Row],[Column51]]&Table_2[[#This Row],[Column52]]&BU475","v":""}]
[null,null,null,null,null,null,null,null,null,null,null,null,0,null,null,0,null,null,0,null,null,0,null,null,0,null,null,0,null,null,null,0,null,null,null,{"$f":"IF(AG474<Instructions!D503,AG474,SUM(AG474:AI474))","v":0},null,null,null,{"$f":"IF(AK474<Instructions!D502,AK474,SUM(AK474:AM474))","v":0},null,null,null,{"$f":"IF(AO474<Instructions!D501,AO474,SUM(AO474:AQ474))","v":0},null,null,{"$f":"SUM(Table_2[[#This Row],[Column20]],Table_2[[#This Row],[Column19]],Table_2[[#This Row],[Column18]])","v":0},"HEALTH & PHY. EDU.",null,null,null,null,null,null,null,null,null,0,null,null,null,null,null,null,null,null,null,null,null,null,null,"E",null,null,null,null,{"$f":"Table_2[[#This Row],[Column51]]&Table_2[[#This Row],[Column52]]&BU476","v":""}]
[null,null,null,null,null,null,null,null,null,null,null,null,0,null,null,0,null,null,0,null,null,0,null,null,0,null,null,0,null,null,null,0,null,null,null,{"$f":"IF(AG475<Instructions!D504,AG475,SUM(AG475:AI475))","v":0},null,null,null,{"$f":"IF(AK475<Instructions!D503,AK475,SUM(AK475:AM475))","v":0},null,null,null,{"$f":"IF(AO475<Instructions!D502,AO475,SUM(AO475:AQ475))","v":0},null,null,{"$f":"SUM(Table_2[[#This Row],[Column20]],Table_2[[#This Row],[Column19]],Table_2[[#This Row],[Column18]])","v":0},"HEALTH & PHY. EDU.",null,null,null,null,null,null,null,null,null,0,null,null,null,null,null,null,null,null,null,null,null,null,null,"E",null,null,null,null,{"$f":"Table_2[[#This Row],[Column51]]&Table_2[[#This Row],[Column52]]&BU477","v":""}]
[null,null,null,null,null,null,null,null,null,null,null,null,0,null,null,0,null,null,0,null,null,0,null,null,0,null,null,0,null,null,null,0,null,null,null,{"$f":"IF(AG476<Instructions!D505,AG476,SUM(AG476:AI476))","v":0},null,null,null,{"$f":"IF(AK476<Instructions!D504,AK476,SUM(AK476:AM476))","v":0},null,null,null,{"$f":"IF(AO476<Instructions!D503,AO476,SUM(AO476:AQ476))","v":0},null,null,{"$f":"SUM(Table_2[[#This Row],[Column20]],Table_2[[#This Row],[Column19]],Table_2[[#This Row],[Column18]])","v":0},"HEALTH & PHY. EDU.",null,null,null,null,null,null,null,null,null,0,null,null,null,null,null,null,null,null,null,null,null,null,null,"E",null,null,null,null,{"$f":"Table_2[[#This Row],[Column51]]&Table_2[[#This Row],[Column52]]&BU478","v":""}]
[null,null,null,null,null,null,null,null,null,null,null,null,0,null,null,0,null,null,0,null,null,0,null,null,0,null,null,0,null,null,null,0,null,null,null,{"$f":"IF(AG477<Instructions!D506,AG477,SUM(AG477:AI477))","v":0},null,null,null,{"$f":"IF(AK477<Instructions!D505,AK477,SUM(AK477:AM477))","v":0},null,null,null,{"$f":"IF(AO477<Instructions!D504,AO477,SUM(AO477:AQ477))","v":0},null,null,{"$f":"SUM(Table_2[[#This Row],[Column20]],Table_2[[#This Row],[Column19]],Table_2[[#This Row],[Column18]])","v":0},"HEALTH & PHY. EDU.",null,null,null,null,null,null,null,null,null,0,null,null,null,null,null,null,null,null,null,null,null,null,null,"E",null,null,null,null,{"$f":"Table_2[[#This Row],[Column51]]&Table_2[[#This Row],[Column52]]&BU479","v":""}]
[null,null,null,null,null,null,null,null,null,null,null,null,0,null,null,0,null,null,0,null,null,0,null,null,0,null,null,0,null,null,null,0,null,null,null,{"$f":"IF(AG478<Instructions!D507,AG478,SUM(AG478:AI478))","v":0},null,null,null,{"$f":"IF(AK478<Instructions!D506,AK478,SUM(AK478:AM478))","v":0},null,null,null,{"$f":"IF(AO478<Instructions!D505,AO478,SUM(AO478:AQ478))","v":0},null,null,{"$f":"SUM(Table_2[[#This Row],[Column20]],Table_2[[#This Row],[Column19]],Table_2[[#This Row],[Column18]])","v":0},"HEALTH & PHY. EDU.",null,null,null,null,null,null,null,null,null,0,null,null,null,null,null,null,null,null,null,null,null,null,null,"E",null,null,null,null,{"$f":"Table_2[[#This Row],[Column51]]&Table_2[[#This Row],[Column52]]&BU480","v":""}]
[null,null,null,null,null,null,null,null,null,null,null,null,0,null,null,0,null,null,0,null,null,0,null,null,0,null,null,0,null,null,null,0,null,null,null,{"$f":"IF(AG479<Instructions!D508,AG479,SUM(AG479:AI479))","v":0},null,null,null,{"$f":"IF(AK479<Instructions!D507,AK479,SUM(AK479:AM479))","v":0},null,null,null,{"$f":"IF(AO479<Instructions!D506,AO479,SUM(AO479:AQ479))","v":0},null,null,{"$f":"SUM(Table_2[[#This Row],[Column20]],Table_2[[#This Row],[Column19]],Table_2[[#This Row],[Column18]])","v":0},"HEALTH & PHY. EDU.",null,null,null,null,null,null,null,null,null,0,null,null,null,null,null,null,null,null,null,null,null,null,null,"E",null,null,null,null,{"$f":"Table_2[[#This Row],[Column51]]&Table_2[[#This Row],[Column52]]&BU481","v":""}]
[null,null,null,null,null,null,null,null,null,null,null,null,0,null,null,0,null,null,0,null,null,0,null,null,0,null,null,0,null,null,null,0,null,null,null,{"$f":"IF(AG480<Instructions!D509,AG480,SUM(AG480:AI480))","v":0},null,null,null,{"$f":"IF(AK480<Instructions!D508,AK480,SUM(AK480:AM480))","v":0},null,null,null,{"$f":"IF(AO480<Instructions!D507,AO480,SUM(AO480:AQ480))","v":0},null,null,{"$f":"SUM(Table_2[[#This Row],[Column20]],Table_2[[#This Row],[Column19]],Table_2[[#This Row],[Column18]])","v":0},"HEALTH & PHY. EDU.",null,null,null,null,null,null,null,null,null,0,null,null,null,null,null,null,null,null,null,null,null,null,null,"E",null,null,null,null,{"$f":"Table_2[[#This Row],[Column51]]&Table_2[[#This Row],[Column52]]&BU482","v":""}]
[null,null,null,null,null,null,null,null,null,null,null,null,0,null,null,0,null,null,0,null,null,0,null,null,0,null,null,0,null,null,null,0,null,null,null,{"$f":"IF(AG481<Instructions!D510,AG481,SUM(AG481:AI481))","v":0},null,null,null,{"$f":"IF(AK481<Instructions!D509,AK481,SUM(AK481:AM481))","v":0},null,null,null,{"$f":"IF(AO481<Instructions!D508,AO481,SUM(AO481:AQ481))","v":0},null,null,{"$f":"SUM(Table_2[[#This Row],[Column20]],Table_2[[#This Row],[Column19]],Table_2[[#This Row],[Column18]])","v":0},"HEALTH & PHY. EDU.",null,null,null,null,null,null,null,null,null,0,null,null,null,null,null,null,null,null,null,null,null,null,null,"E",null,null,null,null,{"$f":"Table_2[[#This Row],[Column51]]&Table_2[[#This Row],[Column52]]&BU483","v":""}]
[null,null,null,null,null,null,null,null,null,null,null,null,0,null,null,0,null,null,0,null,null,0,null,null,0,null,null,0,null,null,null,0,null,null,null,{"$f":"IF(AG482<Instructions!D511,AG482,SUM(AG482:AI482))","v":0},null,null,null,{"$f":"IF(AK482<Instructions!D510,AK482,SUM(AK482:AM482))","v":0},null,null,null,{"$f":"IF(AO482<Instructions!D509,AO482,SUM(AO482:AQ482))","v":0},null,null,{"$f":"SUM(Table_2[[#This Row],[Column20]],Table_2[[#This Row],[Column19]],Table_2[[#This Row],[Column18]])","v":0},"HEALTH & PHY. EDU.",null,null,null,null,null,null,null,null,null,0,null,null,null,null,null,null,null,null,null,null,null,null,null,"E",null,null,null,null,{"$f":"Table_2[[#This Row],[Column51]]&Table_2[[#This Row],[Column52]]&BU484","v":""}]
[null,null,null,null,null,null,null,null,null,null,null,null,0,null,null,0,null,null,0,null,null,0,null,null,0,null,null,0,null,null,null,0,null,null,null,{"$f":"IF(AG483<Instructions!D512,AG483,SUM(AG483:AI483))","v":0},null,null,null,{"$f":"IF(AK483<Instructions!D511,AK483,SUM(AK483:AM483))","v":0},null,null,null,{"$f":"IF(AO483<Instructions!D510,AO483,SUM(AO483:AQ483))","v":0},null,null,{"$f":"SUM(Table_2[[#This Row],[Column20]],Table_2[[#This Row],[Column19]],Table_2[[#This Row],[Column18]])","v":0},"HEALTH & PHY. EDU.",null,null,null,null,null,null,null,null,null,0,null,null,null,null,null,null,null,null,null,null,null,null,null,"E",null,null,null,null,{"$f":"Table_2[[#This Row],[Column51]]&Table_2[[#This Row],[Column52]]&BU485","v":""}]
[null,null,null,null,null,null,null,null,null,null,null,null,0,null,null,0,null,null,0,null,null,0,null,null,0,null,null,0,null,null,null,0,null,null,null,{"$f":"IF(AG484<Instructions!D513,AG484,SUM(AG484:AI484))","v":0},null,null,null,{"$f":"IF(AK484<Instructions!D512,AK484,SUM(AK484:AM484))","v":0},null,null,null,{"$f":"IF(AO484<Instructions!D511,AO484,SUM(AO484:AQ484))","v":0},null,null,{"$f":"SUM(Table_2[[#This Row],[Column20]],Table_2[[#This Row],[Column19]],Table_2[[#This Row],[Column18]])","v":0},"HEALTH & PHY. EDU.",null,null,null,null,null,null,null,null,null,0,null,null,null,null,null,null,null,null,null,null,null,null,null,"E",null,null,null,null,{"$f":"Table_2[[#This Row],[Column51]]&Table_2[[#This Row],[Column52]]&BU486","v":""}]
[null,null,null,null,null,null,null,null,null,null,null,null,0,null,null,0,null,null,0,null,null,0,null,null,0,null,null,0,null,null,null,0,null,null,null,{"$f":"IF(AG485<Instructions!D514,AG485,SUM(AG485:AI485))","v":0},null,null,null,{"$f":"IF(AK485<Instructions!D513,AK485,SUM(AK485:AM485))","v":0},null,null,null,{"$f":"IF(AO485<Instructions!D512,AO485,SUM(AO485:AQ485))","v":0},null,null,{"$f":"SUM(Table_2[[#This Row],[Column20]],Table_2[[#This Row],[Column19]],Table_2[[#This Row],[Column18]])","v":0},"HEALTH & PHY. EDU.",null,null,null,null,null,null,null,null,null,0,null,null,null,null,null,null,null,null,null,null,null,null,null,"E",null,null,null,null,{"$f":"Table_2[[#This Row],[Column51]]&Table_2[[#This Row],[Column52]]&BU487","v":""}]
[null,null,null,null,null,null,null,null,null,null,null,null,0,null,null,0,null,null,0,null,null,0,null,null,0,null,null,0,null,null,null,0,null,null,null,{"$f":"IF(AG486<Instructions!D515,AG486,SUM(AG486:AI486))","v":0},null,null,null,{"$f":"IF(AK486<Instructions!D514,AK486,SUM(AK486:AM486))","v":0},null,null,null,{"$f":"IF(AO486<Instructions!D513,AO486,SUM(AO486:AQ486))","v":0},null,null,{"$f":"SUM(Table_2[[#This Row],[Column20]],Table_2[[#This Row],[Column19]],Table_2[[#This Row],[Column18]])","v":0},"HEALTH & PHY. EDU.",null,null,null,null,null,null,null,null,null,0,null,null,null,null,null,null,null,null,null,null,null,null,null,"E",null,null,null,null,{"$f":"Table_2[[#This Row],[Column51]]&Table_2[[#This Row],[Column52]]&BU488","v":""}]
[null,null,null,null,null,null,null,null,null,null,null,null,0,null,null,0,null,null,0,null,null,0,null,null,0,null,null,0,null,null,null,0,null,null,null,{"$f":"IF(AG487<Instructions!D516,AG487,SUM(AG487:AI487))","v":0},null,null,null,{"$f":"IF(AK487<Instructions!D515,AK487,SUM(AK487:AM487))","v":0},null,null,null,{"$f":"IF(AO487<Instructions!D514,AO487,SUM(AO487:AQ487))","v":0},null,null,{"$f":"SUM(Table_2[[#This Row],[Column20]],Table_2[[#This Row],[Column19]],Table_2[[#This Row],[Column18]])","v":0},"HEALTH & PHY. EDU.",null,null,null,null,null,null,null,null,null,0,null,null,null,null,null,null,null,null,null,null,null,null,null,"E",null,null,null,null,{"$f":"Table_2[[#This Row],[Column51]]&Table_2[[#This Row],[Column52]]&BU489","v":""}]
[null,null,null,null,null,null,null,null,null,null,null,null,0,null,null,0,null,null,0,null,null,0,null,null,0,null,null,0,null,null,null,0,null,null,null,{"$f":"IF(AG488<Instructions!D517,AG488,SUM(AG488:AI488))","v":0},null,null,null,{"$f":"IF(AK488<Instructions!D516,AK488,SUM(AK488:AM488))","v":0},null,null,null,{"$f":"IF(AO488<Instructions!D515,AO488,SUM(AO488:AQ488))","v":0},null,null,{"$f":"SUM(Table_2[[#This Row],[Column20]],Table_2[[#This Row],[Column19]],Table_2[[#This Row],[Column18]])","v":0},"HEALTH & PHY. EDU.",null,null,null,null,null,null,null,null,null,0,null,null,null,null,null,null,null,null,null,null,null,null,null,"E",null,null,null,null,{"$f":"Table_2[[#This Row],[Column51]]&Table_2[[#This Row],[Column52]]&BU490","v":""}]
[null,null,null,null,null,null,null,null,null,null,null,null,0,null,null,0,null,null,0,null,null,0,null,null,0,null,null,0,null,null,null,0,null,null,null,{"$f":"IF(AG489<Instructions!D518,AG489,SUM(AG489:AI489))","v":0},null,null,null,{"$f":"IF(AK489<Instructions!D517,AK489,SUM(AK489:AM489))","v":0},null,null,null,{"$f":"IF(AO489<Instructions!D516,AO489,SUM(AO489:AQ489))","v":0},null,null,{"$f":"SUM(Table_2[[#This Row],[Column20]],Table_2[[#This Row],[Column19]],Table_2[[#This Row],[Column18]])","v":0},"HEALTH & PHY. EDU.",null,null,null,null,null,null,null,null,null,0,null,null,null,null,null,null,null,null,null,null,null,null,null,"E",null,null,null,null,{"$f":"Table_2[[#This Row],[Column51]]&Table_2[[#This Row],[Column52]]&BU491","v":""}]
[null,null,null,null,null,null,null,null,null,null,null,null,0,null,null,0,null,null,0,null,null,0,null,null,0,null,null,0,null,null,null,0,null,null,null,{"$f":"IF(AG490<Instructions!D519,AG490,SUM(AG490:AI490))","v":0},null,null,null,{"$f":"IF(AK490<Instructions!D518,AK490,SUM(AK490:AM490))","v":0},null,null,null,{"$f":"IF(AO490<Instructions!D517,AO490,SUM(AO490:AQ490))","v":0},null,null,{"$f":"SUM(Table_2[[#This Row],[Column20]],Table_2[[#This Row],[Column19]],Table_2[[#This Row],[Column18]])","v":0},"HEALTH & PHY. EDU.",null,null,null,null,null,null,null,null,null,0,null,null,null,null,null,null,null,null,null,null,null,null,null,"E",null,null,null,null,{"$f":"Table_2[[#This Row],[Column51]]&Table_2[[#This Row],[Column52]]&BU492","v":""}]
[null,null,null,null,null,null,null,null,null,null,null,null,0,null,null,0,null,null,0,null,null,0,null,null,0,null,null,0,null,null,null,0,null,null,null,{"$f":"IF(AG491<Instructions!D520,AG491,SUM(AG491:AI491))","v":0},null,null,null,{"$f":"IF(AK491<Instructions!D519,AK491,SUM(AK491:AM491))","v":0},null,null,null,{"$f":"IF(AO491<Instructions!D518,AO491,SUM(AO491:AQ491))","v":0},null,null,{"$f":"SUM(Table_2[[#This Row],[Column20]],Table_2[[#This Row],[Column19]],Table_2[[#This Row],[Column18]])","v":0},"HEALTH & PHY. EDU.",null,null,null,null,null,null,null,null,null,0,null,null,null,null,null,null,null,null,null,null,null,null,null,"E",null,null,null,null,{"$f":"Table_2[[#This Row],[Column51]]&Table_2[[#This Row],[Column52]]&BU493","v":""}]
[null,null,null,null,null,null,null,null,null,null,null,null,0,null,null,0,null,null,0,null,null,0,null,null,0,null,null,0,null,null,null,0,null,null,null,{"$f":"IF(AG492<Instructions!D521,AG492,SUM(AG492:AI492))","v":0},null,null,null,{"$f":"IF(AK492<Instructions!D520,AK492,SUM(AK492:AM492))","v":0},null,null,null,{"$f":"IF(AO492<Instructions!D519,AO492,SUM(AO492:AQ492))","v":0},null,null,{"$f":"SUM(Table_2[[#This Row],[Column20]],Table_2[[#This Row],[Column19]],Table_2[[#This Row],[Column18]])","v":0},"HEALTH & PHY. EDU.",null,null,null,null,null,null,null,null,null,0,null,null,null,null,null,null,null,null,null,null,null,null,null,"E",null,null,null,null,{"$f":"Table_2[[#This Row],[Column51]]&Table_2[[#This Row],[Column52]]&BU494","v":""}]
[null,null,null,null,null,null,null,null,null,null,null,null,0,null,null,0,null,null,0,null,null,0,null,null,0,null,null,0,null,null,null,0,null,null,null,{"$f":"IF(AG493<Instructions!D522,AG493,SUM(AG493:AI493))","v":0},null,null,null,{"$f":"IF(AK493<Instructions!D521,AK493,SUM(AK493:AM493))","v":0},null,null,null,{"$f":"IF(AO493<Instructions!D520,AO493,SUM(AO493:AQ493))","v":0},null,null,{"$f":"SUM(Table_2[[#This Row],[Column20]],Table_2[[#This Row],[Column19]],Table_2[[#This Row],[Column18]])","v":0},"HEALTH & PHY. EDU.",null,null,null,null,null,null,null,null,null,0,null,null,null,null,null,null,null,null,null,null,null,null,null,"E",null,null,null,null,{"$f":"Table_2[[#This Row],[Column51]]&Table_2[[#This Row],[Column52]]&BU495","v":""}]
[null,null,null,null,null,null,null,null,null,null,null,null,0,null,null,0,null,null,0,null,null,0,null,null,0,null,null,0,null,null,null,0,null,null,null,{"$f":"IF(AG494<Instructions!D523,AG494,SUM(AG494:AI494))","v":0},null,null,null,{"$f":"IF(AK494<Instructions!D522,AK494,SUM(AK494:AM494))","v":0},null,null,null,{"$f":"IF(AO494<Instructions!D521,AO494,SUM(AO494:AQ494))","v":0},null,null,{"$f":"SUM(Table_2[[#This Row],[Column20]],Table_2[[#This Row],[Column19]],Table_2[[#This Row],[Column18]])","v":0},"HEALTH & PHY. EDU.",null,null,null,null,null,null,null,null,null,0,null,null,null,null,null,null,null,null,null,null,null,null,null,"E",null,null,null,null,{"$f":"Table_2[[#This Row],[Column51]]&Table_2[[#This Row],[Column52]]&BU496","v":""}]
[null,null,null,null,null,null,null,null,null,null,null,null,0,null,null,0,null,null,0,null,null,0,null,null,0,null,null,0,null,null,null,0,null,null,null,{"$f":"IF(AG495<Instructions!D524,AG495,SUM(AG495:AI495))","v":0},null,null,null,{"$f":"IF(AK495<Instructions!D523,AK495,SUM(AK495:AM495))","v":0},null,null,null,{"$f":"IF(AO495<Instructions!D522,AO495,SUM(AO495:AQ495))","v":0},null,null,{"$f":"SUM(Table_2[[#This Row],[Column20]],Table_2[[#This Row],[Column19]],Table_2[[#This Row],[Column18]])","v":0},"HEALTH & PHY. EDU.",null,null,null,null,null,null,null,null,null,0,null,null,null,null,null,null,null,null,null,null,null,null,null,"E",null,null,null,null,{"$f":"Table_2[[#This Row],[Column51]]&Table_2[[#This Row],[Column52]]&BU497","v":""}]
[null,null,null,null,null,null,null,null,null,null,null,null,0,null,null,0,null,null,0,null,null,0,null,null,0,null,null,0,null,null,null,0,null,null,null,{"$f":"IF(AG496<Instructions!D525,AG496,SUM(AG496:AI496))","v":0},null,null,null,{"$f":"IF(AK496<Instructions!D524,AK496,SUM(AK496:AM496))","v":0},null,null,null,{"$f":"IF(AO496<Instructions!D523,AO496,SUM(AO496:AQ496))","v":0},null,null,{"$f":"SUM(Table_2[[#This Row],[Column20]],Table_2[[#This Row],[Column19]],Table_2[[#This Row],[Column18]])","v":0},"HEALTH & PHY. EDU.",null,null,null,null,null,null,null,null,null,0,null,null,null,null,null,null,null,null,null,null,null,null,null,"E",null,null,null,null,{"$f":"Table_2[[#This Row],[Column51]]&Table_2[[#This Row],[Column52]]&BU498","v":""}]
[null,null,null,null,null,null,null,null,null,null,null,null,0,null,null,0,null,null,0,null,null,0,null,null,0,null,null,0,null,null,null,0,null,null,null,{"$f":"IF(AG497<Instructions!D526,AG497,SUM(AG497:AI497))","v":0},null,null,null,{"$f":"IF(AK497<Instructions!D525,AK497,SUM(AK497:AM497))","v":0},null,null,null,{"$f":"IF(AO497<Instructions!D524,AO497,SUM(AO497:AQ497))","v":0},null,null,{"$f":"SUM(Table_2[[#This Row],[Column20]],Table_2[[#This Row],[Column19]],Table_2[[#This Row],[Column18]])","v":0},"HEALTH & PHY. EDU.",null,null,null,null,null,null,null,null,null,0,null,null,null,null,null,null,null,null,null,null,null,null,null,"E",null,null,null,null,{"$f":"Table_2[[#This Row],[Column51]]&Table_2[[#This Row],[Column52]]&BU499","v":""}]
[null,null,null,null,null,null,null,null,null,null,null,null,0,null,null,0,null,null,0,null,null,0,null,null,0,null,null,0,null,null,null,0,null,null,null,{"$f":"IF(AG498<Instructions!D527,AG498,SUM(AG498:AI498))","v":0},null,null,null,{"$f":"IF(AK498<Instructions!D526,AK498,SUM(AK498:AM498))","v":0},null,null,null,{"$f":"IF(AO498<Instructions!D525,AO498,SUM(AO498:AQ498))","v":0},null,null,{"$f":"SUM(Table_2[[#This Row],[Column20]],Table_2[[#This Row],[Column19]],Table_2[[#This Row],[Column18]])","v":0},"HEALTH & PHY. EDU.",null,null,null,null,null,null,null,null,null,0,null,null,null,null,null,null,null,null,null,null,null,null,null,"E",null,null,null,null,{"$f":"Table_2[[#This Row],[Column51]]&Table_2[[#This Row],[Column52]]&BU500","v":""}]
[null,null,null,null,null,null,null,null,null,null,null,null,0,null,null,0,null,null,0,null,null,0,null,null,0,null,null,0,null,null,null,0,null,null,null,{"$f":"IF(AG499<Instructions!D528,AG499,SUM(AG499:AI499))","v":0},null,null,null,{"$f":"IF(AK499<Instructions!D527,AK499,SUM(AK499:AM499))","v":0},null,null,null,{"$f":"IF(AO499<Instructions!D526,AO499,SUM(AO499:AQ499))","v":0},null,null,{"$f":"SUM(Table_2[[#This Row],[Column20]],Table_2[[#This Row],[Column19]],Table_2[[#This Row],[Column18]])","v":0},"HEALTH & PHY. EDU.",null,null,null,null,null,null,null,null,null,0,null,null,null,null,null,null,null,null,null,null,null,null,null,"E",null,null,null,null,{"$f":"Table_2[[#This Row],[Column51]]&Table_2[[#This Row],[Column52]]&BU501","v":""}]
[null,null,null,null,null,null,null,null,null,null,null,null,0,null,null,0,null,null,0,null,null,0,null,null,0,null,null,0,null,null,null,0,null,null,null,{"$f":"IF(AG500<Instructions!D529,AG500,SUM(AG500:AI500))","v":0},null,null,null,{"$f":"IF(AK500<Instructions!D528,AK500,SUM(AK500:AM500))","v":0},null,null,null,{"$f":"IF(AO500<Instructions!D527,AO500,SUM(AO500:AQ500))","v":0},null,null,{"$f":"SUM(Table_2[[#This Row],[Column20]],Table_2[[#This Row],[Column19]],Table_2[[#This Row],[Column18]])","v":0},"HEALTH & PHY. EDU.",null,null,null,null,null,null,null,null,null,0,null,null,null,null,null,null,null,null,null,null,null,null,null,"E",null,null,null,null,{"$f":"Table_2[[#This Row],[Column51]]&Table_2[[#This Row],[Column52]]&BU502","v":""}]
[null,null,null,null,null,null,null,null,null,null,null,null,0,null,null,0,null,null,0,null,null,0,null,null,0,null,null,0,null,null,null,0,null,null,null,{"$f":"IF(AG501<Instructions!D530,AG501,SUM(AG501:AI501))","v":0},null,null,null,{"$f":"IF(AK501<Instructions!D529,AK501,SUM(AK501:AM501))","v":0},null,null,null,{"$f":"IF(AO501<Instructions!D528,AO501,SUM(AO501:AQ501))","v":0},null,null,{"$f":"SUM(Table_2[[#This Row],[Column20]],Table_2[[#This Row],[Column19]],Table_2[[#This Row],[Column18]])","v":0},"HEALTH & PHY. EDU.",null,null,null,null,null,null,null,null,null,0,null,null,null,null,null,null,null,null,null,null,null,null,null,"E",null,null,null,null,{"$f":"Table_2[[#This Row],[Column51]]&Table_2[[#This Row],[Column52]]&BU503","v":""}]
[null,null,null,null,null,null,null,null,null,null,null,null,0,null,null,0,null,null,0,null,null,0,null,null,0,null,null,0,null,null,null,0,null,null,null,{"$f":"IF(AG502<Instructions!D531,AG502,SUM(AG502:AI502))","v":0},null,null,null,{"$f":"IF(AK502<Instructions!D530,AK502,SUM(AK502:AM502))","v":0},null,null,null,{"$f":"IF(AO502<Instructions!D529,AO502,SUM(AO502:AQ502))","v":0},null,null,{"$f":"SUM(Table_2[[#This Row],[Column20]],Table_2[[#This Row],[Column19]],Table_2[[#This Row],[Column18]])","v":0},"HEALTH & PHY. EDU.",null,null,null,null,null,null,null,null,null,0,null,null,null,null,null,null,null,null,null,null,null,null,null,"E",null,null,null,null,{"$f":"Table_2[[#This Row],[Column51]]&Table_2[[#This Row],[Column52]]&BU504","v":""}]
[null,null,null,null,null,null,null,null,null,null,null,null,0,null,null,0,null,null,0,null,null,0,null,null,0,null,null,0,null,null,null,0,null,null,null,{"$f":"IF(AG503<Instructions!D532,AG503,SUM(AG503:AI503))","v":0},null,null,null,{"$f":"IF(AK503<Instructions!D531,AK503,SUM(AK503:AM503))","v":0},null,null,null,{"$f":"IF(AO503<Instructions!D530,AO503,SUM(AO503:AQ503))","v":0},null,null,{"$f":"SUM(Table_2[[#This Row],[Column20]],Table_2[[#This Row],[Column19]],Table_2[[#This Row],[Column18]])","v":0},"HEALTH & PHY. EDU.",null,null,null,null,null,null,null,null,null,0,null,null,null,null,null,null,null,null,null,null,null,null,null,"E",null,null,null,null,{"$f":"Table_2[[#This Row],[Column51]]&Table_2[[#This Row],[Column52]]&BU505","v":""}]

{"sheet":"Report Card","index":2,"n_rows":39,"n_cols":18,"rows_kept":39,"cut":false,"hidden":false,"merged":[[9,8,9,9],[10,8,10,9],[19,2,19,5],[19,6,19,7],[23,9,24,9],[36,2,36,4],[30,1,30,4],[31,1,31,4],[32,1,32,4],[30,5,30,8],[31,5,31,8],[32,5,32,8],[29,1,29,4],[28,1,28,8],[20,2,20,5],[20,6,20,7],[23,8,24,8],[22,2,22,5],[22,6,22,7],[25,1,25,2],[25,3,25,4],[25,5,25,6],[23,1,24,1],[23,2,24,5],[23,6,24,7],[1,0,1,3],[11,4,11,7],[5,0,5,10],[15,6,15,7],[9,4,9,7],[10,4,10,7],[11,1,11,3],[12,1,12,9],[13,1,13,9],[14,2,14,5],[14,6,14,7],[11,8,11,9],[7,4,7,7],[8,4,8,7],[8,8,8,9],[15,2,15,5],[38,8,38,10],[6,12,7,12],[9,1,9,3],[10,1,10,3],[7,1,7,3],[8,1,8,3],[21,2,21,5],[21,6,21,7],[16,2,16,5],[16,6,16,7],[17,2,17,5],[17,6,17,7],[18,2,18,5],[18,6,18,7],[26,1,26,9],[29,5,29,8]]}
[]
[{"$f":"\"        Serial No./\"&Q3&\"/\"&R3&\"/\"&N8","v":"        Serial No./March/2026/1"}]
[null,null,null,null,null,null,null,null,null,null,null,null,null,null,null,null,{"$f":"Instructions!C19","v":"March"},{"$f":"Instructions!B19","v":2026}]
[]
[null,null,null,null,null,null,null,null,null,null,null,null,"Total Number of Record",{"$f":"COUNTA('Marks Entry'!F:F)","v":2}]
[{"$f":"\"Report Card \"&Q3& \" - \"&R3","v":"Report Card March - 2026"}]
[null,null,null,null,null,null,null,null,null,null,null,null,"Sr No. of Record"]
[null,"Student Name        :",null,null,{"$f":"IFERROR(VLOOKUP($N$8,'Marks Entry'!$A$2:$BW$402,6,0),\"\")","v":"Ram"},null,null,null,null,null,null,null,null,1]
[null,"E-Punjab ID              :",null,null,{"$f":"IFERROR(VLOOKUP($N$8,'Marks Entry'!$A$2:$BW$402,5,0),\"\")","v":12122}]
[null,"Father’s Name       :",null,null,{"$f":"IFERROR(VLOOKUP($N$8,'Marks Entry'!$A$2:$BW$402,7,0),\"\")","v":"Sham"}]
[null,"Mother’s Name     :",null,null,{"$f":"IFERROR(VLOOKUP($N$8,'Marks Entry'!$A$2:$BW$402,8,0),\"\")","v":"rita"}]
[null,"Class & Section      :",null,null,{"$f":"IFERROR(VLOOKUP($N$8,'Marks Entry'!$A$2:$BW$402,3,0)&\" \"&VLOOKUP($N$8,'Marks Entry'!$A$2:$BW$402,4,0),\"\")","v":"10 A"}]
[null,{"$f":"\"has secured subject wise marks and grade as mentioned below in School Examination held in \" & Q3 & \"  \"&R3","v":"has secured subject wise marks and grade as mentioned below in School Examination held in March  2026"}]
[]
[null,"Sr. no.","Subject Name",null,null,null,"Total Marks",null,"Marks Obtained","Grade"]
[null,1,"PUNJABI",null,null,null,{"$f":"Instructions!C23","v":150},null,{"$f":"IFERROR(VLOOKUP($N$8,'Marks Entry'!$A$2:$BW$402,13,0),\"\")","v":70},{"$f":"IFERROR(VLOOKUP($N$8,'Marks Entry'!$A$2:$BW$402,61,0),\"\")","v":"C"}]
[null,2,"ENGLISH",null,null,null,{"$f":"Instructions!C24","v":100},null,{"$f":"IFERROR(VLOOKUP($N$8,'Marks Entry'!$A$2:$BW$402,16,0),\"\")","v":40},{"$f":"IFERROR(VLOOKUP($N$8,'Marks Entry'!$A$2:$BW$402,62,0),\"\")","v":"D"}]
[null,3,"HINDI",null,null,null,{"$f":"Instructions!C25","v":100},null,{"$f":"IFERROR(VLOOKUP($N$8,'Marks Entry'!$A$2:$BW$402,19,0),\"\")","v":100},{"$f":"IFERROR(VLOOKUP($N$8,'Marks Entry'!$A$2:$BW$402,63,0),\"\")","v":"A+"}]
[null,4,"MATHEMATICS",null,null,null,{"$f":"Instructions!C26","v":100},null,{"$f":"IFERROR(VLOOKUP($N$8,'Marks Entry'!$A$2:$BW$402,22,0),\"\")","v":0},{"$f":"IFERROR(VLOOKUP($N$8,'Marks Entry'!$A$2:$BW$402,64,0),\"\")","v":"E"}]
[null,5,"SCIENCE",null,null,null,{"$f":"Instructions!C27","v":100},null,{"$f":"IFERROR(VLOOKUP($N$8,'Marks Entry'!$A$2:$BW$402,25,0),\"\")","v":70},{"$f":"IFERROR(VLOOKUP($N$8,'Marks Entry'!$A$2:$BW$402,65,0),\"\")","v":"B"}]
[null,6,"SOCIAL SCIENCE",null,null,null,{"$f":"Instructions!C28","v":100},null,{"$f":"IFERROR(VLOOKUP($N$8,'Marks Entry'!$A$2:$BW$402,28,0),\"\")","v":60},{"$f":"IFERROR(VLOOKUP($N$8,'Marks Entry'!$A$2:$BW$402,66,0),\"\")","v":"C+"}]
[null,7,"*COMPUTER SCIENCE",null,null,null,{"$f":"Instructions!C29","v":100},null,{"$f":"IFERROR(VLOOKUP($N$8,'Marks Entry'!$A$2:$BW$402,32,0),\"\")","v":0},{"$f":"IFERROR(VLOOKUP($N$8,'Marks Entry'!$A$2:$BW$402,67,0),\"\")","v":"E"}]
[null,8,{"$f":"\"*\"&IFERROR(VLOOKUP($N$8,'Marks Entry'!$A$2:$BW$402,48,0),\"\")","v":"*MECH. DRAWING & PAINTING"},null,null,null,{"$f":"Instructions!C30","v":100},null,{"$f":"IFERROR(VLOOKUP($N$8,'Marks Entry'!$A$2:$BW$402,47,0),\"\")","v":60},{"$f":"IFERROR(VLOOKUP($N$8,'Marks Entry'!$A$2:$BW$402,72,0),\"\")","v":"C+"}]
[]
[]
[null,"RESULT    :",null,{"$f":"IFERROR(VLOOKUP($N$8,'Marks Entry'!$A$2:$BW$402,60,0),\"\")","v":"----"},null,"Grand Total",null,{"$f":"Instructions!C33","v":650},{"$f":"IFERROR(VLOOKUP($N$8,'Marks Entry'!$A$2:$BW$402,46,0),\"\")","v":0},{"$f":"IFERROR(VLOOKUP($N$8,'Marks Entry'!$A$2:$BW$402,71,0),\"\")","v":"--"}]
[null,"Note: * Implies marks obtained in subjects are grading subjects and have not been added in Grand Total"]
[]
[null,"Grade Description"]
[null,"A+  Above 90% marks ",null,null,null,"A  Above 80% & upto 90% marks"]
[null,"B+  Above 70% & upto  80% marks",null,null,null,"B  Above 60% & upto 70% marks"]
[null,"C+  Above 50% & upto 60% marks",null,null,null,"C  Above 40% & upto 50% marks"]
[null,"D   33%  & upto 40% marks",null,null,null,"E Below 33% marks"]
[]
[]
[]
[null,"Date   :  ",{"$f":"Instructions!C20","v":"2026-03-31"},null,null,null,null,null,null,"Signature "]
[]
[null,null,null,null,null,null,null,null,"www.Teachershelp.in  "]

{"sheet":"Abstract","index":3,"n_rows":14,"n_cols":16,"rows_kept":14,"cut":false,"hidden":false,"merged":[[0,0,0,10],[0,13,0,15],[13,1,13,4]]}
["Subject & Grade Wise  Students Counts Details",null,null,null,null,null,null,null,null,null,null,null,null,{"$f":"\"Topper of Class \"&B2","v":"Topper of Class 9th"}]
["Class","9th","Section","A",null,null,null,null,null,null,null,null,null,"Rank","Student Name","Marks"]
["Grade/Subject","Punjabi ","English","Hindi","Maths.","Science","Social Sci.","Computer Sci","Welcome Life","Drawing","Physical Edu.",null,null,1,"AMRITPREET KAUR",650]
["A+",{"$f":"COUNTIFS('Marks Entry'!$C:$C,$B$2,'Marks Entry'!$D:$D,$D$2,'Marks Entry'!BI:BI,$A4)","v":0},{"$f":"COUNTIFS('Marks Entry'!$C:$C,$B$2,'Marks Entry'!$D:$D,$D$2,'Marks Entry'!BJ:BJ,$A4)","v":0},{"$f":"COUNTIFS('Marks Entry'!$C:$C,$B$2,'Marks Entry'!$D:$D,$D$2,'Marks Entry'!BK:BK,$A4)","v":0},{"$f":"COUNTIFS('Marks Entry'!$C:$C,$B$2,'Marks Entry'!$D:$D,$D$2,'Marks Entry'!BL:BL,$A4)","v":0},{"$f":"COUNTIFS('Marks Entry'!$C:$C,$B$2,'Marks Entry'!$D:$D,$D$2,'Marks Entry'!BM:BM,$A4)","v":0},{"$f":"COUNTIFS('Marks Entry'!$C:$C,$B$2,'Marks Entry'!$D:$D,$D$2,'Marks Entry'!BN:BN,$A4)","v":0},{"$f":"COUNTIFS('Marks Entry'!$C:$C,$B$2,'Marks Entry'!$D:$D,$D$2,'Marks Entry'!BO:BO,$A4)","v":0},{"$f":"COUNTIFS('Marks Entry'!$C:$C,$B$2,'Marks Entry'!$D:$D,$D$2,'Marks Entry'!BP:BP,$A4)","v":0},{"$f":"COUNTIFS('Marks Entry'!$C:$C,$B$2,'Marks Entry'!$D:$D,$D$2,'Marks Entry'!BQ:BQ,$A4)","v":0},{"$f":"COUNTIFS('Marks Entry'!$C:$C,$B$2,'Marks Entry'!$D:$D,$D$2,'Marks Entry'!BR:BR,$A4)","v":0},null,null,2,"ASHOK",600]
["A",{"$f":"COUNTIFS('Marks Entry'!$C:$C,$B$2,'Marks Entry'!$D:$D,$D$2,'Marks Entry'!BI:BI,$A5)","v":0},{"$f":"COUNTIFS('Marks Entry'!$C:$C,$B$2,'Marks Entry'!$D:$D,$D$2,'Marks Entry'!BJ:BJ,$A5)","v":0},{"$f":"COUNTIFS('Marks Entry'!$C:$C,$B$2,'Marks Entry'!$D:$D,$D$2,'Marks Entry'!BK:BK,$A5)","v":0},{"$f":"COUNTIFS('Marks Entry'!$C:$C,$B$2,'Marks Entry'!$D:$D,$D$2,'Marks Entry'!BL:BL,$A5)","v":0},{"$f":"COUNTIFS('Marks Entry'!$C:$C,$B$2,'Marks Entry'!$D:$D,$D$2,'Marks Entry'!BM:BM,$A5)","v":0},{"$f":"COUNTIFS('Marks Entry'!$C:$C,$B$2,'Marks Entry'!$D:$D,$D$2,'Marks Entry'!BN:BN,$A5)","v":0},{"$f":"COUNTIFS('Marks Entry'!$C:$C,$B$2,'Marks Entry'!$D:$D,$D$2,'Marks Entry'!BO:BO,$A5)","v":0},{"$f":"COUNTIFS('Marks Entry'!$C:$C,$B$2,'Marks Entry'!$D:$D,$D$2,'Marks Entry'!BP:BP,$A5)","v":0},{"$f":"COUNTIFS('Marks Entry'!$C:$C,$B$2,'Marks Entry'!$D:$D,$D$2,'Marks Entry'!BQ:BQ,$A5)","v":0},{"$f":"COUNTIFS('Marks Entry'!$C:$C,$B$2,'Marks Entry'!$D:$D,$D$2,'Marks Entry'!BR:BR,$A5)","v":0},null,null,3,"ARIF",599]
["B+",{"$f":"COUNTIFS('Marks Entry'!$C:$C,$B$2,'Marks Entry'!$D:$D,$D$2,'Marks Entry'!BI:BI,$A6)","v":0},{"$f":"COUNTIFS('Marks Entry'!$C:$C,$B$2,'Marks Entry'!$D:$D,$D$2,'Marks Entry'!BJ:BJ,$A6)","v":0},{"$f":"COUNTIFS('Marks Entry'!$C:$C,$B$2,'Marks Entry'!$D:$D,$D$2,'Marks Entry'!BK:BK,$A6)","v":0},{"$f":"COUNTIFS('Marks Entry'!$C:$C,$B$2,'Marks Entry'!$D:$D,$D$2,'Marks Entry'!BL:BL,$A6)","v":0},{"$f":"COUNTIFS('Marks Entry'!$C:$C,$B$2,'Marks Entry'!$D:$D,$D$2,'Marks Entry'!BM:BM,$A6)","v":0},{"$f":"COUNTIFS('Marks Entry'!$C:$C,$B$2,'Marks Entry'!$D:$D,$D$2,'Marks Entry'!BN:BN,$A6)","v":0},{"$f":"COUNTIFS('Marks Entry'!$C:$C,$B$2,'Marks Entry'!$D:$D,$D$2,'Marks Entry'!BO:BO,$A6)","v":0},{"$f":"COUNTIFS('Marks Entry'!$C:$C,$B$2,'Marks Entry'!$D:$D,$D$2,'Marks Entry'!BP:BP,$A6)","v":0},{"$f":"COUNTIFS('Marks Entry'!$C:$C,$B$2,'Marks Entry'!$D:$D,$D$2,'Marks Entry'!BQ:BQ,$A6)","v":0},{"$f":"COUNTIFS('Marks Entry'!$C:$C,$B$2,'Marks Entry'!$D:$D,$D$2,'Marks Entry'!BR:BR,$A6)","v":0},null,null,4,"CHAMAN",550]
["B",{"$f":"COUNTIFS('Marks Entry'!$C:$C,$B$2,'Marks Entry'!$D:$D,$D$2,'Marks Entry'!BI:BI,$A7)","v":0},{"$f":"COUNTIFS('Marks Entry'!$C:$C,$B$2,'Marks Entry'!$D:$D,$D$2,'Marks Entry'!BJ:BJ,$A7)","v":0},{"$f":"COUNTIFS('Marks Entry'!$C:$C,$B$2,'Marks Entry'!$D:$D,$D$2,'Marks Entry'!BK:BK,$A7)","v":0},{"$f":"COUNTIFS('Marks Entry'!$C:$C,$B$2,'Marks Entry'!$D:$D,$D$2,'Marks Entry'!BL:BL,$A7)","v":0},{"$f":"COUNTIFS('Marks Entry'!$C:$C,$B$2,'Marks Entry'!$D:$D,$D$2,'Marks Entry'!BM:BM,$A7)","v":0},{"$f":"COUNTIFS('Marks Entry'!$C:$C,$B$2,'Marks Entry'!$D:$D,$D$2,'Marks Entry'!BN:BN,$A7)","v":0},{"$f":"COUNTIFS('Marks Entry'!$C:$C,$B$2,'Marks Entry'!$D:$D,$D$2,'Marks Entry'!BO:BO,$A7)","v":0},{"$f":"COUNTIFS('Marks Entry'!$C:$C,$B$2,'Marks Entry'!$D:$D,$D$2,'Marks Entry'!BP:BP,$A7)","v":0},{"$f":"COUNTIFS('Marks Entry'!$C:$C,$B$2,'Marks Entry'!$D:$D,$D$2,'Marks Entry'!BQ:BQ,$A7)","v":0},{"$f":"COUNTIFS('Marks Entry'!$C:$C,$B$2,'Marks Entry'!$D:$D,$D$2,'Marks Entry'!BR:BR,$A7)","v":0},null,null,5,"PINKI KUMARI",549]
["C+",{"$f":"COUNTIFS('Marks Entry'!$C:$C,$B$2,'Marks Entry'!$D:$D,$D$2,'Marks Entry'!BI:BI,$A8)","v":0},{"$f":"COUNTIFS('Marks Entry'!$C:$C,$B$2,'Marks Entry'!$D:$D,$D$2,'Marks Entry'!BJ:BJ,$A8)","v":0},{"$f":"COUNTIFS('Marks Entry'!$C:$C,$B$2,'Marks Entry'!$D:$D,$D$2,'Marks Entry'!BK:BK,$A8)","v":0},{"$f":"COUNTIFS('Marks Entry'!$C:$C,$B$2,'Marks Entry'!$D:$D,$D$2,'Marks Entry'!BL:BL,$A8)","v":0},{"$f":"COUNTIFS('Marks Entry'!$C:$C,$B$2,'Marks Entry'!$D:$D,$D$2,'Marks Entry'!BM:BM,$A8)","v":0},{"$f":"COUNTIFS('Marks Entry'!$C:$C,$B$2,'Marks Entry'!$D:$D,$D$2,'Marks Entry'!BN:BN,$A8)","v":0},{"$f":"COUNTIFS('Marks Entry'!$C:$C,$B$2,'Marks Entry'!$D:$D,$D$2,'Marks Entry'!BO:BO,$A8)","v":0},{"$f":"COUNTIFS('Marks Entry'!$C:$C,$B$2,'Marks Entry'!$D:$D,$D$2,'Marks Entry'!BP:BP,$A8)","v":0},{"$f":"COUNTIFS('Marks Entry'!$C:$C,$B$2,'Marks Entry'!$D:$D,$D$2,'Marks Entry'!BQ:BQ,$A8)","v":0},{"$f":"COUNTIFS('Marks Entry'!$C:$C,$B$2,'Marks Entry'!$D:$D,$D$2,'Marks Entry'!BR:BR,$A8)","v":0},null,null,6,"ASHISH",549]
["C",{"$f":"COUNTIFS('Marks Entry'!$C:$C,$B$2,'Marks Entry'!$D:$D,$D$2,'Marks Entry'!BI:BI,$A9)","v":0},{"$f":"COUNTIFS('Marks Entry'!$C:$C,$B$2,'Marks Entry'!$D:$D,$D$2,'Marks Entry'!BJ:BJ,$A9)","v":0},{"$f":"COUNTIFS('Marks Entry'!$C:$C,$B$2,'Marks Entry'!$D:$D,$D$2,'Marks Entry'!BK:BK,$A9)","v":0},{"$f":"COUNTIFS('Marks Entry'!$C:$C,$B$2,'Marks Entry'!$D:$D,$D$2,'Marks Entry'!BL:BL,$A9)","v":0},{"$f":"COUNTIFS('Marks Entry'!$C:$C,$B$2,'Marks Entry'!$D:$D,$D$2,'Marks Entry'!BM:BM,$A9)","v":0},{"$f":"COUNTIFS('Marks Entry'!$C:$C,$B$2,'Marks Entry'!$D:$D,$D$2,'Marks Entry'!BN:BN,$A9)","v":0},{"$f":"COUNTIFS('Marks Entry'!$C:$C,$B$2,'Marks Entry'!$D:$D,$D$2,'Marks Entry'!BO:BO,$A9)","v":0},{"$f":"COUNTIFS('Marks Entry'!$C:$C,$B$2,'Marks Entry'!$D:$D,$D$2,'Marks Entry'!BP:BP,$A9)","v":0},{"$f":"COUNTIFS('Marks Entry'!$C:$C,$B$2,'Marks Entry'!$D:$D,$D$2,'Marks Entry'!BQ:BQ,$A9)","v":0},{"$f":"COUNTIFS('Marks Entry'!$C:$C,$B$2,'Marks Entry'!$D:$D,$D$2,'Marks Entry'!BR:BR,$A9)","v":0},null,null,7,"SAHAJPREET KAUR",547]
["D",{"$f":"COUNTIFS('Marks Entry'!$C:$C,$B$2,'Marks Entry'!$D:$D,$D$2,'Marks Entry'!BI:BI,$A10)","v":0},{"$f":"COUNTIFS('Marks Entry'!$C:$C,$B$2,'Marks Entry'!$D:$D,$D$2,'Marks Entry'!BJ:BJ,$A10)","v":0},{"$f":"COUNTIFS('Marks Entry'!$C:$C,$B$2,'Marks Entry'!$D:$D,$D$2,'Marks Entry'!BK:BK,$A10)","v":0},{"$f":"COUNTIFS('Marks Entry'!$C:$C,$B$2,'Marks Entry'!$D:$D,$D$2,'Marks Entry'!BL:BL,$A10)","v":0},{"$f":"COUNTIFS('Marks Entry'!$C:$C,$B$2,'Marks Entry'!$D:$D,$D$2,'Marks Entry'!BM:BM,$A10)","v":0},{"$f":"COUNTIFS('Marks Entry'!$C:$C,$B$2,'Marks Entry'!$D:$D,$D$2,'Marks Entry'!BN:BN,$A10)","v":0},{"$f":"COUNTIFS('Marks Entry'!$C:$C,$B$2,'Marks Entry'!$D:$D,$D$2,'Marks Entry'!BO:BO,$A10)","v":0},{"$f":"COUNTIFS('Marks Entry'!$C:$C,$B$2,'Marks Entry'!$D:$D,$D$2,'Marks Entry'!BP:BP,$A10)","v":0},{"$f":"COUNTIFS('Marks Entry'!$C:$C,$B$2,'Marks Entry'!$D:$D,$D$2,'Marks Entry'!BQ:BQ,$A10)","v":0},{"$f":"COUNTIFS('Marks Entry'!$C:$C,$B$2,'Marks Entry'!$D:$D,$D$2,'Marks Entry'!BR:BR,$A10)","v":0},null,null,8,"BHOLA",546]
["E",{"$f":"COUNTIFS('Marks Entry'!$C:$C,$B$2,'Marks Entry'!$D:$D,$D$2,'Marks Entry'!BI:BI,$A11)","v":0},{"$f":"COUNTIFS('Marks Entry'!$C:$C,$B$2,'Marks Entry'!$D:$D,$D$2,'Marks Entry'!BJ:BJ,$A11)","v":0},{"$f":"COUNTIFS('Marks Entry'!$C:$C,$B$2,'Marks Entry'!$D:$D,$D$2,'Marks Entry'!BK:BK,$A11)","v":0},{"$f":"COUNTIFS('Marks Entry'!$C:$C,$B$2,'Marks Entry'!$D:$D,$D$2,'Marks Entry'!BL:BL,$A11)","v":0},{"$f":"COUNTIFS('Marks Entry'!$C:$C,$B$2,'Marks Entry'!$D:$D,$D$2,'Marks Entry'!BM:BM,$A11)","v":0},{"$f":"COUNTIFS('Marks Entry'!$C:$C,$B$2,'Marks Entry'!$D:$D,$D$2,'Marks Entry'!BN:BN,$A11)","v":0},{"$f":"COUNTIFS('Marks Entry'!$C:$C,$B$2,'Marks Entry'!$D:$D,$D$2,'Marks Entry'!BO:BO,$A11)","v":0},{"$f":"COUNTIFS('Marks Entry'!$C:$C,$B$2,'Marks Entry'!$D:$D,$D$2,'Marks Entry'!BP:BP,$A11)","v":0},{"$f":"COUNTIFS('Marks Entry'!$C:$C,$B$2,'Marks Entry'!$D:$D,$D$2,'Marks Entry'!BQ:BQ,$A11)","v":0},{"$f":"COUNTIFS('Marks Entry'!$C:$C,$B$2,'Marks Entry'!$D:$D,$D$2,'Marks Entry'!BR:BR,$A11)","v":0},null,null,9,"RAJDEEP KAUR",544]
["Total Student",{"$f":"SUM(B4:B11)","v":0},{"$f":"SUM(C4:C11)","v":0},0,0,0,0,0,0,0,0,null,null,10,"SHAGANPREET KAUR",543]
[]
[null,"Total Fail/Reappear Students ",null,null,null,{"$f":"COUNTIFS('Marks Entry'!C3:C600,B2,'Marks Entry'!AT3:AT600,0)","v":0}]