{"text_format":"1","workbook":"xlsx","n_sheets":4,"sheets":["Instructions","Marks Entry","Report Card","Abstract"],"not_rendered":{"charts":1,"images":2,"macros":1,"external_links":1,"defined_names":3,"comments":0,"pivot_tables":0},"unopened":[],"bounds":{"document_bytes":16777216,"sheet_cells":100000,"rows_first":2000,"rows_last":500,"rows_between":2000,"halvings":0,"cell_chars":16384,"cell_head_chars":4096},"cells_cut":0,"cells_raw":0,"read":"whole","date_system":"1900"}

{"sheet":"Instructions","index":0,"n_rows":36,"n_cols":12,"rows_kept":36,"cut":false,"hidden":false,"merged":[[0,0,0,5],[16,1,16,2],[21,1,21,2],[8,1,8,4],[3,1,3,2],[4,1,4,5],[9,1,9,4],[6,1,6,6],[7,1,7,6]]}
["Instructions",null,null,null,null,null,null,null,null,null,"Year","Month"]
["Kindly read All Instructions before Use Report Card Utitly",null,null,null,null,null,null,null,null,null,2022,"Sept"]
[null,null,null,null,null,null,null,null,null,null,2023,"March"]
[1,"First Fill  Necessary Data for report card by click on ",null,"Fill Data",null,null,null,null,null,null,2024]
[2,"In All Sheet Use only or Click on  Yellow coloured Filled  Cell to Enter or Select Data. Rest Cells Are Locked",null,null,null,null,null,null,null,null,2025]
[3,"Now Goto Marks Entry Sheet 6-8 . Then Enter Data ( Marks) in Yellow cell thier",null,null,null,null,null,null,null,null,2026]
[4,"Enter Subjects Total Marks for Each Subject in this sheet at Row no . 20 onwards",null,null,null,null,null,null,null,null,2027]
[5,"You can find Grade Wise , Class Wise , Subject Wise Students count and Topper List",null,null,null,null,null,null,null,null,2028]
[6,"you can copy Paste Students Data Like Name ,Father Name, Class Etc.  From Epunjab Student Report Excel File",null,null,null,null,null,null,null,null,2029]
[7,"After Entered All data in yellow cell of Marks Entry 6-8 Sheet . Goto Report Card to View/Print report card of each Students",null,null,null,null,null,null,null,null,2030]
{"$rows_left_out":27}
{"sheet":"Marks Entry","index":1,"n_rows":503,"n_cols":77,"rows_kept":503,"cut":false,"hidden":false,"merged":[[0,40,0,43],[0,36,0,39],[0,32,0,35],[0,10,0,12],[0,13,0,15],[0,28,0,31],[0,16,0,18],[0,19,0,21],[0,22,0,24],[0,25,0,27]]}
[null,null,null,null,null,null,null,null,null,null,"Punjabi",null,null,"English",null,null,"Hindi",null,null,"Maths",null,null,"Science",null,null,"social Sci.",null,null,"Computer Sci",null,null,null,{"$f":"Instructions!B32","v":"NSQF"},null,null,null,{"$f":"Instructions!B31","v":"MECH. DRAWING & PAINTING"},null,null,null,{"$f":"Instructions!B30","v":"HEALTH & PHY. EDU."}]
["Sno",null,"Class","Sec","Student ID","Name","FatherName","MotherName","DOB","Gender","Th. (130)","INA (20)","Total","Th. (80)","INA (20)","Total","Th. (80)","INA (20)","Total","Th. (80)","INA (20)","Total","Th. (80)","INA (20)","Total","Th. (80)","INA (20)","Total","Th.","INA (20)","Pract","Total","Th.","INA ","Pract","Total","Th.","INA ","Pract",{"$f":"IF(AK2<Instructions!H31,\"\",SUM(AK2:AM2))","v":0},"Th.","INA ","Pract","Total","Total Marks ","Total w/o F","Elective Subh","Sub Name","Pbi%","Eng","Hindi","Maths.","Science","social Sci.","Com Sci","NSQF","Drawing","Elec Sub %","Total %","Pass/Fail","Pbi Grade. ","Eng","Hindi","Maths.","Science","SS","Com Sci","NSQF","Drg","Phy","Grade total","Elec Sub Grade",null,null,null,null,{"$f":"Table_2[[#This Row],[Column51]]&Table_2[[#This Row],[Column52]]&BU4","v":""}]
[1,null,10,"A",12122,"Ram","Sham","rita","25-2-25","Male",50,20,{"$f":"IF(K3<33,K3,SUM(K3:L3))","v":70},20,20,{"$f":"IF(N3<20,N3,SUM(N3:O3))","v":40},80,20,{"$f":"IF(Q3<20,Q3,SUM(Q3:R3))","v":100},null,20,{"$f":"IF(T3<20,T3,SUM(T3:U3))","v":0},60,10,{"$f":"IF(W3<20,W3,SUM(W3:X3))","v":70},40,20,{"$f":"IF(Z3<20,Z3,SUM(Z3:AA3))","v":60},null,20,30,{"$f":"IF(AC3<10,AC3,SUM(AC3:AE3))","v":0},null,null,null,{"$f":"IF(AG3<Instructions!D32,AG3,SUM(AG3:AI3))","v":0},40,20,null,{"$f":"IF(AK3<Instructions!D31,AK3,SUM(AK3:AM3))","v":60},null,null,null,{"$f":"IF(AO3<Instructions!D30,AO3,SUM(AO3:AQ3))","v":0},{"$f":"IF(MIN(M3,P3,S3,V3,Y3,AB3)>=33,SUM(M3,P3,S3,V3,Y3,AB3),\"--\")","v":"--"},{"$f":"IF(AS3=\"--\",0,AS3)","v":0},{"$f":"SUM(Table_2[[#This Row],[Column20]],Table_2[[#This Row],[Column19]],Table_2[[#This Row],[Column18]])","v":60},{"$f":"IF(N(AJ3)>0,$AG$1,IF(N(AN3)>0,$AK$1,$AO$1))","v":"MECH. DRAWING & PAINTING"},{"$f":"(M3/Instructions!$C$23)*100","v":46.666666666666664},{"$f":"(P3/Instructions!$C$24)*100","v":40},{"$f":"(S3/Instructions!$C$25)*100","v":100},{"$f":"(V3/Instructions!$C$26)*100","v":0},{"$f":"(Y3/Instructions!$C$27)*100","v":70},{"$f":"(AB3/Instructions!$C$28)*100","v":60},{"$f":"(AF3/Instructions!$C$29)*100","v":0},{"$f":"(AJ3/Instructions!$C$30)*100","v":0},{"$f":"(AN3/Instructions!$C$31)*100","v":60},{"$f":"(AU3/100)*100","v":60},{"$f":"(AS3/Instructions!$C$33)*100","v":{"$error":"#VALUE!"}},{"$f":"IF(AND(AW3>=33,AX3>=33,AY3>=33,AZ3>=33,BA3>=33,BB3>=33),\"PASS\",\"----\")","v":"----"},{"$f":"IFERROR(IF(AW3>90,\"A+\",IF(AW3>80,\"A\",IF(AW3>70,\"B+\",IF(AW3>60,\"B\",IF(AW3>50,\"C+\",IF(AW3>40,\"C\",IF(AW3>=33,\"D\",\"E\"))))))),\"Abs\")","v":"C"},"D","A+","E","B","C+","E","E","C+","C+",{"$f":"IFERROR(IF(BG3>90,\"A+\",IF(BG3>80,\"A\",IF(BG3>70,\"B+\",IF(BG3>60,\"B\",IF(BG3>50,\"C+\",IF(BG3>40,\"C\",IF(BG3>=33,\"D\",\"E\"))))))),\"--\")","v":"--"},{"$f":"IFERROR(IF(BF3>90,\"A+\",IF(BF3>80,\"A\",IF(BF3>70,\"B+\",IF(BF3>60,\"B\",IF(BF3>50,\"C+\",IF(BF3>40,\"C\",IF(BF3>=33,\"D\",\"E\"))))))),\"Abs\")","v":"C+"},null,null,null,null,{"$f":"Table_2[[#This Row],[Column51]]&Table_2[[#This Row],[Column52]]&BU5","v":""}]
[2,null,null,null,null,null,null,null,null,null,null,null,{"$f":"IF(K4<33,K4,SUM(K4:L4))","v":0},null,null,{"$f":"IF(N4<20,N4,SUM(N4:O4))","v":0},null,null,{"$f":"IF(Q4<20,Q4,SUM(Q4:R4))","v":0},null,null,{"$f":"IF(T4<20,T4,SUM(T4:U4))","v":0},null,null,{"$f":"IF(W4<20,W4,SUM(W4:X4))","v":0},null,null,{"$f":"IF(Z4<20,Z4,SUM(Z4:AA4))","v":0},null,null,null,{"$f":"IF(AC4<10,AC4,SUM(AC4:AE4))","v":0},null,null,null,{"$f":"IF(AG4<Instructions!D33,AG4,SUM(AG4:AI4))","v":0},null,null,null,{"$f":"IF(AK4<Instructions!D32,AK4,SUM(AK4:AM4))","v":0},null,null,null,{"$f":"IF(AO4<Instructions!D31,AO4,SUM(AO4:AQ4))","v":0},{"$f":"IF(MIN(M4,P4,S4,V4,Y4,AB4)>=33,SUM(M4,P4,S4,V4,Y4,AB4),\"--\")","v":"--"},{"$f":"IF(AS4=\"--\",0,AS4)","v":0},{"$f":"SUM(Table_2[[#This Row],[Column20]],Table_2[[#This Row],[Column19]],Table_2[[#This Row],[Column18]])","v":0},{"$f":"IF(N(AJ4)>0,$AG$1,IF(N(AN4)>0,$AK$1,$AO$1))","v":"HEALTH & PHY. EDU."},{"$f":"(M4/Instructions!$C$23)*100","v":0},{"$f":"(P4/Instructions!$C$24)*100","v":0},{"$f":"(S4/Instructions!$C$25)*100","v":0},{"$f":"(V4/Instructions!$C$26)*100","v":0},{"$f":"(Y4/Instructions!$C$27)*100","v":0},{"$f":"(AB4/Instructions!$C$28)*100","v":0},{"$f":"(AF4/Instructions!$C$29)*100","v":0},{"$f":"(AJ4/Instructions!$C$30)*100","v":0},{"$f":"(AN4/Instructions!$C$31)*100","v":0},{"$f":"(AR4/100)*100","v":0},{"$f":"(AS4/Instructions!$C$33)*100","v":{"$error":"#VALUE!"}},{"$f":"IF(AND(AW4>=33,AX4>=33,AY4>=33,AZ4>=33,BA4>=33,BB4>=33),\"PASS\",\"----\")","v":"----"},"E","E","E","E","E","E","E","E","E","E",{"$f":"IFERROR(IF(BG4>90,\"A+\",IF(BG4>80,\"A\",IF(BG4>70,\"B+\",IF(BG4>60,\"B\",IF(BG4>50,\"C+\",IF(BG4>40,\"C\",IF(BG4>=33,\"D\",\"E\"))))))),\"--\")","v":"--"},{"$f":"IFERROR(IF(BF4>90,\"A+\",IF(BF4>80,\"A\",IF(BF4>70,\"B+\",IF(BF4>60,\"B\",IF(BF4>50,\"C+\",IF(BF4>40,\"C\",IF(BF4>=33,\"D\",\"E\"))))))),\"Abs\")","v":"E"},null,null,null,null,{"$f":"Table_2[[#This Row],[Column51]]&Table_2[[#This Row],[Column52]]&BU6","v":""}]
[3,null,null,null,null,null,null,null,null,null,null,null,0,null,null,0,null,null,0,null,null,0,null,null,0,null,null,0,null,null,null,0,null,null,null,{"$f":"IF(AG5<Instructions!D34,AG5,SUM(AG5:AI5))","v":0},null,null,null,{"$f":"IF(AK5<Instructions!D33,AK5,SUM(AK5:AM5))","v":0},null,null,null,{"$f":"IF(AO5<Instructions!D32,AO5,SUM(AO5:AQ5))","v":0},"--",0,{"$f":"SUM(Table_2[[#This Row],[Column20]],Table_2[[#This Row],[Column19]],Table_2[[#This Row],[Column18]])","v":0},"HEALTH & PHY. EDU.",{"$f":"(M5/Instructions!$C$23)*100","v":0},{"$f":"(P5/Instructions!$C$24)*100","v":0},{"$f":"(S5/Instructions!$C$25)*100","v":0},{"$f":"(V5/Instructions!$C$26)*100","v":0},{"$f":"(Y5/Instructions!$C$27)*100","v":0},{"$f":"(AB5/Instructions!$C$28)*100","v":0},{"$f":"(AF5/Instructions!$C$29)*100","v":0},{"$f":"(AJ5/Instructions!$C$30)*100","v":0},{"$f":"(AN5/Instructions!$C$31)*100","v":0},0,{"$f":"(AS5/Instructions!$C$33)*100","v":{"$error":"#VALUE!"}},"----","E","E","E","E","E","E","E","E","E","E","--","E"]
[4,null,null,null,null,null,null,null,null,null,null,null,0,null,null,0,null,null,0,null,null,0,null,null,0,null,null,0,null,null,null,0,null,null,null,{"$f":"IF(AG6<Instructions!D35,AG6,SUM(AG6:AI6))","v":0},null,null,null,{"$f":"IF(AK6<Instructions!D34,AK6,SUM(AK6:AM6))","v":0},null,null,null,{"$f":"IF(AO6<Instructions!D33,AO6,SUM(AO6:AQ6))","v":0},"--",0,{"$f":"SUM(Table_2[[#This Row],[Column20]],Table_2[[#This Row],[Column19]],Table_2[[#This Row],[Column18]])","v":0},"HEALTH & PHY. EDU.",{"$f":"(M6/Instructions!$C$23)*100","v":0},{"$f":"(P6/Instructions!$C$24)*100","v":0},{"$f":"(S6/Instructions!$C$25)*100","v":0},{"$f":"(V6/Instructions!$C$26)*100","v":0},{"$f":"(Y6/Instructions!$C$27)*100","v":0},{"$f":"(AB6/Instructions!$C$28)*100","v":0},{"$f":"(AF6/Instructions!$C$29)*100","v":0},{"$f":"(AJ6/Instructions!$C$30)*100","v":0},{"$f":"(AN6/Instructions!$C$31)*100","v":0},0,{"$f":"(AS6/Instructions!$C$33)*100","v":{"$error":"#VALUE!"}},"----","E","E","E","E","E","E","E","E","E","E","--","E"]
[5,null,null,null,null,null,null,null,null,null,null,null,0,null,null,0,null,null,0,null,null,0,null,null,0,null,null,0,null,null,null,0,null,null,null,{"$f":"IF(AG7<Instructions!D36,AG7,SUM(AG7:AI7))","v":0},null,null,null,{"$f":"IF(AK7<Instructions!D35,AK7,SUM(AK7:AM7))","v":0},null,null,null,{"$f":"IF(AO7<Instructions!D34,AO7,SUM(AO7:AQ7))","v":0},"--",0,{"$f":"SUM(Table_2[[#This Row],[Column20]],Table_2[[#This Row],[Column19]],Table_2[[#This Row],[Column18]])","v":0},"HEALTH & PHY. EDU.",{"$f":"(M7/Instructions!$C$23)*100","v":0},{"$f":"(P7/Instructions!$C$24)*100","v":0},{"$f":"(S7/Instructions!$C$25)*100","v":0},{"$f":"(V7/Instructions!$C$26)*100","v":0},{"$f":"(Y7/Instructions!$C$27)*100","v":0},{"$f":"(AB7/Instructions!$C$28)*100","v":0},{"$f":"(AF7/Instructions!$C$29)*100","v":0},{"$f":"(AJ7/Instructions!$C$30)*100","v":0},{"$f":"(AN7/Instructions!$C$31)*100","v":0},0,{"$f":"(AS7/Instructions!$C$33)*100","v":{"$error":"#VALUE!"}},"----","E","E","E","E","E","E","E","E","E","E","--","E"]
[6,null,null,null,null,null,null,null,null,null,null,null,0,null,null,0,null,null,0,null,null,0,null,null,0,null,null,0,null,null,null,0,null,null,null,{"$f":"IF(AG8<Instructions!D37,AG8,SUM(AG8:AI8))","v":0},null,null,null,{"$f":"IF(AK8<Instructions!D36,AK8,SUM(AK8:AM8))","v":0},null,null,null,{"$f":"IF(AO8<Instructions!D35,AO8,SUM(AO8:AQ8))","v":0},"--",0,{"$f":"SUM(Table_2[[#This Row],[Column20]],Table_2[[#This Row],[Column19]],Table_2[[#This Row],[Column18]])","v":0},"HEALTH & PHY. EDU.",{"$f":"(M8/Instructions!$C$23)*100","v":0},{"$f":"(P8/Instructions!$C$24)*100","v":0},{"$f":"(S8/Instructions!$C$25)*100","v":0},{"$f":"(V8/Instructions!$C$26)*100","v":0},{"$f":"(Y8/Instructions!$C$27)*100","v":0},{"$f":"(AB8/Instructions!$C$28)*100","v":0},{"$f":"(AF8/Instructions!$C$29)*100","v":0},{"$f":"(AJ8/Instructions!$C$30)*100","v":0},{"$f":"(AN8/Instructions!$C$31)*100","v":0},0,{"$f":"(AS8/Instructions!$C$33)*100","v":{"$error":"#VALUE!"}},"----","E","E","E","E","E","E","E","E","E","E","--","E"]
[7,null,null,null,null,null,null,null,null,null,null,null,0,null,null,0,null,null,0,null,null,0,null,null,0,null,null,0,null,null,null,0,null,null,null,{"$f":"IF(AG9<Instructions!D38,AG9,SUM(AG9:AI9))","v":0},null,null,null,{"$f":"IF(AK9<Instructions!D37,AK9,SUM(AK9:AM9))","v":0},null,null,null,{"$f":"IF(AO9<Instructions!D36,AO9,SUM(AO9:AQ9))","v":0},"--",0,{"$f":"SUM(Table_2[[#This Row],[Column20]],Table_2[[#This Row],[Column19]],Table_2[[#This Row],[Column18]])","v":0},"HEALTH & PHY. EDU.",{"$f":"(M9/Instructions!$C$23)*100","v":0},{"$f":"(P9/Instructions!$C$24)*100","v":0},{"$f":"(S9/Instructions!$C$25)*100","v":0},{"$f":"(V9/Instructions!$C$26)*100","v":0},{"$f":"(Y9/Instructions!$C$27)*100","v":0},{"$f":"(AB9/Instructions!$C$28)*100","v":0},{"$f":"(AF9/Instructions!$C$29)*100","v":0},{"$f":"(AJ9/Instructions!$C$30)*100","v":0},{"$f":"(AN9/Instructions!$C$31)*100","v":0},0,{"$f":"(AS9/Instructions!$C$33)*100","v":{"$error":"#VALUE!"}},"----","E","E","E","E","E","E","E","E","E","E","--","E"]
[8,null,null,null,null,null,null,null,null,null,null,null,0,null,null,0,null,null,0,null,null,0,null,null,0,null,null,0,null,null,null,0,null,null,null,{"$f":"IF(AG10<Instructions!D39,AG10,SUM(AG10:AI10))","v":0},null,null,null,{"$f":"IF(AK10<Instructions!D38,AK10,SUM(AK10:AM10))","v":0},null,null,null,{"$f":"IF(AO10<Instructions!D37,AO10,SUM(AO10:AQ10))","v":0},"--",0,{"$f":"SUM(Table_2[[#This Row],[Column20]],Table_2[[#This Row],[Column19]],Table_2[[#This Row],[Column18]])","v":0},"HEALTH & PHY. EDU.",{"$f":"(M10/Instructions!$C$23)*100","v":0},{"$f":"(P10/Instructions!$C$24)*100","v":0},{"$f":"(S10/Instructions!$C$25)*100","v":0},{"$f":"(V10/Instructions!$C$26)*100","v":0},{"$f":"(Y10/Instructions!$C$27)*100","v":0},{"$f":"(AB10/Instructions!$C$28)*100","v":0},{"$f":"(AF10/Instructions!$C$29)*100","v":0},{"$f":"(AJ10/Instructions!$C$30)*100","v":0},{"$f":"(AN10/Instructions!$C$31)*100","v":0},0,{"$f":"(AS10/Instructions!$C$33)*100","v":{"$error":"#VALUE!"}},"----","E","E","E","E","E","E","E","E","E","E","--","E"]
{"$rows_left_out":494}
{"sheet":"Report Card","index":2,"n_rows":39,"n_cols":18,"rows_kept":39,"cut":false,"hidden":false,"merged":[[9,8,9,9],[10,8,10,9],[19,2,19,5],[19,6,19,7],[23,9,24,9],[36,2,36,4],[30,1,30,4],[31,1,31,4],[32,1,32,4],[30,5,30,8],[31,5,31,8],[32,5,32,8],[29,1,29,4],[28,1,28,8],[20,2,20,5],[20,6,20,7],[23,8,24,8],[22,2,22,5],[22,6,22,7],[25,1,25,2],[25,3,25,4],[25,5,25,6],[23,1,24,1],[23,2,24,5],[23,6,24,7],[1,0,1,3],[11,4,11,7],[5,0,5,10],[15,6,15,7],[9,4,9,7],[10,4,10,7],[11,1,11,3],[12,1,12,9],[13,1,13,9],[14,2,14,5],[14,6,14,7],[11,8,11,9],[7,4,7,7],[8,4,8,7],[8,8,8,9],[15,2,15,5],[38,8,38,10],[6,12,7,12],[9,1,9,3],[10,1,10,3],[7,1,7,3],[8,1,8,3],[21,2,21,5],[21,6,21,7],[16,2,16,5],[16,6,16,7],[17,2,17,5],[17,6,17,7],[18,2,18,5],[18,6,18,7],[26,1,26,9],[29,5,29,8]]}
[]
[{"$f":"\"        Serial No./\"&Q3&\"/\"&R3&\"/\"&N8","v":"        Serial No./March/2026/1"}]
[null,null,null,null,null,null,null,null,null,null,null,null,null,null,null,null,{"$f":"Instructions!C19","v":"March"},{"$f":"Instructions!B19","v":2026}]
[]
[null,null,null,null,null,null,null,null,null,null,null,null,"Total Number of Record",{"$f":"COUNTA('Marks Entry'!F:F)","v":2}]
[{"$f":"\"Report Card \"&Q3& \" - \"&R3","v":"Report Card March - 2026"}]
[null,null,null,null,null,null,null,null,null,null,null,null,"Sr No. of Record"]
[null,"Student Name        :",null,null,{"$f":"IFERROR(VLOOKUP($N$8,'Marks Entry'!$A$2:$BW$402,6,0),\"\")","v":"Ram"},null,null,null,null,null,null,null,null,1]
[null,"E-Punjab ID              :",null,null,{"$f":"IFERROR(VLOOKUP($N$8,'Marks Entry'!$A$2:$BW$402,5,0),\"\")","v":12122}]
[null,"Father’s Name       :",null,null,{"$f":"IFERROR(VLOOKUP($N$8,'Marks Entry'!$A$2:$BW$402,7,0),\"\")","v":"Sham"}]
{"$rows_left_out":30}
{"sheet":"Abstract","index":3,"n_rows":14,"n_cols":16,"rows_kept":14,"cut":false,"hidden":false,"merged":[[0,0,0,10],[0,13,0,15],[13,1,13,4]]}
["Subject & Grade Wise  Students Counts Details",null,null,null,null,null,null,null,null,null,null,null,null,{"$f":"\"Topper of Class \"&B2","v":"Topper of Class 9th"}]
["Class","9th","Section","A",null,null,null,null,null,null,null,null,null,"Rank","Student Name","Marks"]
["Grade/Subject","Punjabi ","English","Hindi","Maths.","Science","Social Sci.","Computer Sci","Welcome Life","Drawing","Physical Edu.",null,null,1,"AMRITPREET KAUR",650]
["A+",{"$f":"COUNTIFS('Marks Entry'!$C:$C,$B$2,'Marks Entry'!$D:$D,$D$2,'Marks Entry'!BI:BI,$A4)","v":0},{"$f":"COUNTIFS('Marks Entry'!$C:$C,$B$2,'Marks Entry'!$D:$D,$D$2,'Marks Entry'!BJ:BJ,$A4)","v":0},{"$f":"COUNTIFS('Marks Entry'!$C:$C,$B$2,'Marks Entry'!$D:$D,$D$2,'Marks Entry'!BK:BK,$A4)","v":0},{"$f":"COUNTIFS('Marks Entry'!$C:$C,$B$2,'Marks Entry'!$D:$D,$D$2,'Marks Entry'!BL:BL,$A4)","v":0},{"$f":"COUNTIFS('Marks Entry'!$C:$C,$B$2,'Marks Entry'!$D:$D,$D$2,'Marks Entry'!BM:BM,$A4)","v":0},{"$f":"COUNTIFS('Marks Entry'!$C:$C,$B$2,'Marks Entry'!$D:$D,$D$2,'Marks Entry'!BN:BN,$A4)","v":0},{"$f":"COUNTIFS('Marks Entry'!$C:$C,$B$2,'Marks Entry'!$D:$D,$D$2,'Marks Entry'!BO:BO,$A4)","v":0},{"$f":"COUNTIFS('Marks Entry'!$C:$C,$B$2,'Marks Entry'!$D:$D,$D$2,'Marks Entry'!BP:BP,$A4)","v":0},{"$f":"COUNTIFS('Marks Entry'!$C:$C,$B$2,'Marks Entry'!$D:$D,$D$2,'Marks Entry'!BQ:BQ,$A4)","v":0},{"$f":"COUNTIFS('Marks Entry'!$C:$C,$B$2,'Marks Entry'!$D:$D,$D$2,'Marks Entry'!BR:BR,$A4)","v":0},null,null,2,"ASHOK",600]
["A",{"$f":"COUNTIFS('Marks Entry'!$C:$C,$B$2,'Marks Entry'!$D:$D,$D$2,'Marks Entry'!BI:BI,$A5)","v":0},{"$f":"COUNTIFS('Marks Entry'!$C:$C,$B$2,'Marks Entry'!$D:$D,$D$2,'Marks Entry'!BJ:BJ,$A5)","v":0},{"$f":"COUNTIFS('Marks Entry'!$C:$C,$B$2,'Marks Entry'!$D:$D,$D$2,'Marks Entry'!BK:BK,$A5)","v":0},{"$f":"COUNTIFS('Marks Entry'!$C:$C,$B$2,'Marks Entry'!$D:$D,$D$2,'Marks Entry'!BL:BL,$A5)","v":0},{"$f":"COUNTIFS('Marks Entry'!$C:$C,$B$2,'Marks Entry'!$D:$D,$D$2,'Marks Entry'!BM:BM,$A5)","v":0},{"$f":"COUNTIFS('Marks Entry'!$C:$C,$B$2,'Marks Entry'!$D:$D,$D$2,'Marks Entry'!BN:BN,$A5)","v":0},{"$f":"COUNTIFS('Marks Entry'!$C:$C,$B$2,'Marks Entry'!$D:$D,$D$2,'Marks Entry'!BO:BO,$A5)","v":0},{"$f":"COUNTIFS('Marks Entry'!$C:$C,$B$2,'Marks Entry'!$D:$D,$D$2,'Marks Entry'!BP:BP,$A5)","v":0},{"$f":"COUNTIFS('Marks Entry'!$C:$C,$B$2,'Marks Entry'!$D:$D,$D$2,'Marks Entry'!BQ:BQ,$A5)","v":0},{"$f":"COUNTIFS('Marks Entry'!$C:$C,$B$2,'Marks Entry'!$D:$D,$D$2,'Marks Entry'!BR:BR,$A5)","v":0},null,null,3,"ARIF",599]
["B+",{"$f":"COUNTIFS('Marks Entry'!$C:$C,$B$2,'Marks Entry'!$D:$D,$D$2,'Marks Entry'!BI:BI,$A6)","v":0},{"$f":"COUNTIFS('Marks Entry'!$C:$C,$B$2,'Marks Entry'!$D:$D,$D$2,'Marks Entry'!BJ:BJ,$A6)","v":0},{"$f":"COUNTIFS('Marks Entry'!$C:$C,$B$2,'Marks Entry'!$D:$D,$D$2,'Marks Entry'!BK:BK,$A6)","v":0},{"$f":"COUNTIFS('Marks Entry'!$C:$C,$B$2,'Marks Entry'!$D:$D,$D$2,'Marks Entry'!BL:BL,$A6)","v":0},{"$f":"COUNTIFS('Marks Entry'!$C:$C,$B$2,'Marks Entry'!$D:$D,$D$2,'Marks Entry'!BM:BM,$A6)","v":0},{"$f":"COUNTIFS('Marks Entry'!$C:$C,$B$2,'Marks Entry'!$D:$D,$D$2,'Marks Entry'!BN:BN,$A6)","v":0},{"$f":"COUNTIFS('Marks Entry'!$C:$C,$B$2,'Marks Entry'!$D:$D,$D$2,'Marks Entry'!BO:BO,$A6)","v":0},{"$f":"COUNTIFS('Marks Entry'!$C:$C,$B$2,'Marks Entry'!$D:$D,$D$2,'Marks Entry'!BP:BP,$A6)","v":0},{"$f":"COUNTIFS('Marks Entry'!$C:$C,$B$2,'Marks Entry'!$D:$D,$D$2,'Marks Entry'!BQ:BQ,$A6)","v":0},{"$f":"COUNTIFS('Marks Entry'!$C:$C,$B$2,'Marks Entry'!$D:$D,$D$2,'Marks Entry'!BR:BR,$A6)","v":0},null,null,4,"CHAMAN",550]
["B",{"$f":"COUNTIFS('Marks Entry'!$C:$C,$B$2,'Marks Entry'!$D:$D,$D$2,'Marks Entry'!BI:BI,$A7)","v":0},{"$f":"COUNTIFS('Marks Entry'!$C:$C,$B$2,'Marks Entry'!$D:$D,$D$2,'Marks Entry'!BJ:BJ,$A7)","v":0},{"$f":"COUNTIFS('Marks Entry'!$C:$C,$B$2,'Marks Entry'!$D:$D,$D$2,'Marks Entry'!BK:BK,$A7)","v":0},{"$f":"COUNTIFS('Marks Entry'!$C:$C,$B$2,'Marks Entry'!$D:$D,$D$2,'Marks Entry'!BL:BL,$A7)","v":0},{"$f":"COUNTIFS('Marks Entry'!$C:$C,$B$2,'Marks Entry'!$D:$D,$D$2,'Marks Entry'!BM:BM,$A7)","v":0},{"$f":"COUNTIFS('Marks Entry'!$C:$C,$B$2,'Marks Entry'!$D:$D,$D$2,'Marks Entry'!BN:BN,$A7)","v":0},{"$f":"COUNTIFS('Marks Entry'!$C:$C,$B$2,'Marks Entry'!$D:$D,$D$2,'Marks Entry'!BO:BO,$A7)","v":0},{"$f":"COUNTIFS('Marks Entry'!$C:$C,$B$2,'Marks Entry'!$D:$D,$D$2,'Marks Entry'!BP:BP,$A7)","v":0},{"$f":"COUNTIFS('Marks Entry'!$C:$C,$B$2,'Marks Entry'!$D:$D,$D$2,'Marks Entry'!BQ:BQ,$A7)","v":0},{"$f":"COUNTIFS('Marks Entry'!$C:$C,$B$2,'Marks Entry'!$D:$D,$D$2,'Marks Entry'!BR:BR,$A7)","v":0},null,null,5,"PINKI KUMARI",549]
["C+",{"$f":"COUNTIFS('Marks Entry'!$C:$C,$B$2,'Marks Entry'!$D:$D,$D$2,'Marks Entry'!BI:BI,$A8)","v":0},{"$f":"COUNTIFS('Marks Entry'!$C:$C,$B$2,'Marks Entry'!$D:$D,$D$2,'Marks Entry'!BJ:BJ,$A8)","v":0},{"$f":"COUNTIFS('Marks Entry'!$C:$C,$B$2,'Marks Entry'!$D:$D,$D$2,'Marks Entry'!BK:BK,$A8)","v":0},{"$f":"COUNTIFS('Marks Entry'!$C:$C,$B$2,'Marks Entry'!$D:$D,$D$2,'Marks Entry'!BL:BL,$A8)","v":0},{"$f":"COUNTIFS('Marks Entry'!$C:$C,$B$2,'Marks Entry'!$D:$D,$D$2,'Marks Entry'!BM:BM,$A8)","v":0},{"$f":"COUNTIFS('Marks Entry'!$C:$C,$B$2,'Marks Entry'!$D:$D,$D$2,'Marks Entry'!BN:BN,$A8)","v":0},{"$f":"COUNTIFS('Marks Entry'!$C:$C,$B$2,'Marks Entry'!$D:$D,$D$2,'Marks Entry'!BO:BO,$A8)","v":0},{"$f":"COUNTIFS('Marks Entry'!$C:$C,$B$2,'Marks Entry'!$D:$D,$D$2,'Marks Entry'!BP:BP,$A8)","v":0},{"$f":"COUNTIFS('Marks Entry'!$C:$C,$B$2,'Marks Entry'!$D:$D,$D$2,'Marks Entry'!BQ:BQ,$A8)","v":0},{"$f":"COUNTIFS('Marks Entry'!$C:$C,$B$2,'Marks Entry'!$D:$D,$D$2,'Marks Entry'!BR:BR,$A8)","v":0},null,null,6,"ASHISH",549]
["C",{"$f":"COUNTIFS('Marks Entry'!$C:$C,$B$2,'Marks Entry'!$D:$D,$D$2,'Marks Entry'!BI:BI,$A9)","v":0},{"$f":"COUNTIFS('Marks Entry'!$C:$C,$B$2,'Marks Entry'!$D:$D,$D$2,'Marks Entry'!BJ:BJ,$A9)","v":0},{"$f":"COUNTIFS('Marks Entry'!$C:$C,$B$2,'Marks Entry'!$D:$D,$D$2,'Marks Entry'!BK:BK,$A9)","v":0},{"$f":"COUNTIFS('Marks Entry'!$C:$C,$B$2,'Marks Entry'!$D:$D,$D$2,'Marks Entry'!BL:BL,$A9)","v":0},{"$f":"COUNTIFS('Marks Entry'!$C:$C,$B$2,'Marks Entry'!$D:$D,$D$2,'Marks Entry'!BM:BM,$A9)","v":0},{"$f":"COUNTIFS('Marks Entry'!$C:$C,$B$2,'Marks Entry'!$D:$D,$D$2,'Marks Entry'!BN:BN,$A9)","v":0},{"$f":"COUNTIFS('Marks Entry'!$C:$C,$B$2,'Marks Entry'!$D:$D,$D$2,'Marks Entry'!BO:BO,$A9)","v":0},{"$f":"COUNTIFS('Marks Entry'!$C:$C,$B$2,'Marks Entry'!$D:$D,$D$2,'Marks Entry'!BP:BP,$A9)","v":0},{"$f":"COUNTIFS('Marks Entry'!$C:$C,$B$2,'Marks Entry'!$D:$D,$D$2,'Marks Entry'!BQ:BQ,$A9)","v":0},{"$f":"COUNTIFS('Marks Entry'!$C:$C,$B$2,'Marks Entry'!$D:$D,$D$2,'Marks Entry'!BR:BR,$A9)","v":0},null,null,7,"SAHAJPREET KAUR",547]
["D",{"$f":"COUNTIFS('Marks Entry'!$C:$C,$B$2,'Marks Entry'!$D:$D,$D$2,'Marks Entry'!BI:BI,$A10)","v":0},{"$f":"COUNTIFS('Marks Entry'!$C:$C,$B$2,'Marks Entry'!$D:$D,$D$2,'Marks Entry'!BJ:BJ,$A10)","v":0},{"$f":"COUNTIFS('Marks Entry'!$C:$C,$B$2,'Marks Entry'!$D:$D,$D$2,'Marks Entry'!BK:BK,$A10)","v":0},{"$f":"COUNTIFS('Marks Entry'!$C:$C,$B$2,'Marks Entry'!$D:$D,$D$2,'Marks Entry'!BL:BL,$A10)","v":0},{"$f":"COUNTIFS('Marks Entry'!$C:$C,$B$2,'Marks Entry'!$D:$D,$D$2,'Marks Entry'!BM:BM,$A10)","v":0},{"$f":"COUNTIFS('Marks Entry'!$C:$C,$B$2,'Marks Entry'!$D:$D,$D$2,'Marks Entry'!BN:BN,$A10)","v":0},{"$f":"COUNTIFS('Marks Entry'!$C:$C,$B$2,'Marks Entry'!$D:$D,$D$2,'Marks Entry'!BO:BO,$A10)","v":0},{"$f":"COUNTIFS('Marks Entry'!$C:$C,$B$2,'Marks Entry'!$D:$D,$D$2,'Marks Entry'!BP:BP,$A10)","v":0},{"$f":"COUNTIFS('Marks Entry'!$C:$C,$B$2,'Marks Entry'!$D:$D,$D$2,'Marks Entry'!BQ:BQ,$A10)","v":0},{"$f":"COUNTIFS('Marks Entry'!$C:$C,$B$2,'Marks Entry'!$D:$D,$D$2,'Marks Entry'!BR:BR,$A10)","v":0},null,null,8,"BHOLA",546]
{"$rows_left_out":4}